Fix unittest for solo8

9 jobs for pr/93 in 1 minute and 11 seconds (queued for 1 second)
Status Name Job ID Coverage
  Test
failed doc-coverage #121335

00:00:20

failed format #121336

00:00:07

passed robotpkg-example-robot-data-18.04-release #121328

00:01:10

failed robotpkg-py-example-robot-data-py2-18.04-release #121329

00:00:18

failed robotpkg-py-example-robot-data-py3-18.04-release #121330

00:01:07

failed robotpkg-py-example-robot-data-py3-20.04-release #121331

00:00:54

failed robotpkg-py-example-robot-data-py3-buster-release #121332

00:00:27

failed robotpkg-py-example-robot-data-py3-ferrum-release #121333

00:00:50

failed robotpkg-py-example-robot-data-py3-stretch-release #121334

00:01:10

 
Name Stage Failure
failed
robotpkg-py-example-robot-data-py3-20.04-release Test

Total Test time (real) = 0.25 sec

The following tests FAILED:
1 - py-load (Failed)
Errors while running CTest
make: *** [Makefile:110: test] Error 8
Cleaning up file based variables
ERROR: Job failed: exit code 1
failed
robotpkg-py-example-robot-data-py3-ferrum-release Test
Total Test time (real) =   0.30 sec

The following tests FAILED:
1 - py-load (Failed)
Errors while running CTest
Makefile:128: recipe for target 'test' failed
make: *** [test] Error 8
Cleaning up file based variables
ERROR: Job failed: exit code 1
failed
robotpkg-py-example-robot-data-py3-buster-release Test

Total Test time (real) = 0.12 sec

The following tests FAILED:
1 - py-load (Failed)
Errors while running CTest
make: *** [Makefile:110: test] Error 8
Cleaning up file based variables
ERROR: Job failed: exit code 1
failed
robotpkg-py-example-robot-data-py3-stretch-release Test
Total Test time (real) =   0.26 sec

The following tests FAILED:
1 - py-load (Failed)
Errors while running CTest
make: *** [test] Error 8
Makefile:74: recipe for target 'test' failed
Cleaning up file based variables
ERROR: Job failed: exit code 1
failed
robotpkg-py-example-robot-data-py3-18.04-release Test
Total Test time (real) =   0.24 sec

The following tests FAILED:
1 - py-load (Failed)
Errors while running CTest
Makefile:109: recipe for target 'test' failed
make: *** [test] Error 8
Cleaning up file based variables
ERROR: Job failed: exit code 1
failed
doc-coverage Test
------------------------------------------------------------------------------
File Lines Exec Cover Missing
------------------------------------------------------------------------------
------------------------------------------------------------------------------
TOTAL 0 0 --%
------------------------------------------------------------------------------
$ gcovr -e CMakeFiles -r . --html --html-details -o ${CI_PROJECT_DIR}/coverage/index.html
Cleaning up file based variables
ERROR: Job failed: exit code 1
failed
robotpkg-py-example-robot-data-py2-18.04-release Test
Total Test time (real) =   0.15 sec

The following tests FAILED:
1 - py-load (Failed)
Makefile:109: recipe for target 'test' failed
Errors while running CTest
make: *** [test] Error 8
Cleaning up file based variables
ERROR: Job failed: exit code 1
failed
format Test
Using docker image sha256:7d18877096946a27a7f5384ab15194ad10b7a65f52809f4540553d06bb59e1a1 for gepetto/linters with digest gepetto/linters@sha256:58da1c4fe2b1dfd36043b3f5c01feef424b8188f1bb33e4f56926e85b17a6e03 ...
$ test -f /builds/setup.cfg || ln -s /root/setup.cfg /builds
$ test -f /builds/.clang-format || ln -s /root/.clang-format /builds
$ check-clang-format.sh
error: cannot use -i when reading from stdin.
$ flake8 .
./python/example_robot_data/robots_loader.py:501:13: F821 undefined name 'SoloLoader'
Cleaning up file based variables
ERROR: Job failed: exit code 1