[sot-loader] Allow the user to load the device in python from a simple string.

10 jobs for pr/194 in 8 minutes and 48 seconds (queued for 3 seconds)
Status Name Job ID Coverage
  Test
passed doc-coverage #135190

00:08:46

33.0%
failed format #135191

00:00:10

passed robotpkg-py-sot-core-v3-18.04 #135182

00:04:43

passed robotpkg-py-sot-core-v3-20.04 #135183

00:05:13

passed robotpkg-py-sot-core-v3-buster #135184

00:05:50

passed robotpkg-py-sot-core-v3-ferrum #135185

00:07:56

failed robotpkg-sot-core-v3-18.04 #135186
allowed to fail

00:00:37

failed robotpkg-sot-core-v3-20.04 #135187
allowed to fail

00:00:11

failed robotpkg-sot-core-v3-buster #135188
allowed to fail

00:00:33

failed robotpkg-sot-core-v3-ferrum #135189
allowed to fail

00:00:13

 
Name Stage Failure
failed
robotpkg-sot-core-v3-18.04 Test

For details or bug reports, check the complete log file in:
/root/robotpkg/wip/sot-core-v3/work/configure.log
/root/robotpkg/mk/configure/cmake-configure.mk:100: recipe for target 'do-configure-cmake' failed
make: *** [do-configure-cmake] Error 1
/root/robotpkg/mk/internal/trusted.mk:36: recipe for target 'install' failed
make: *** [install] Error 2
Cleaning up project directory and file based variables
ERROR: Job failed: exit code 1

failed
robotpkg-sot-core-v3-buster Test
| See also "/root/robotpkg/wip/sot-core-v3/work/sot-core-4.11.6/CMakeFiles/CMakeOutput.log".
| See also "/root/robotpkg/wip/sot-core-v3/work/sot-core-4.11.6/CMakeFiles/CMakeError.log".

For details or bug reports, check the complete log file in:
/root/robotpkg/wip/sot-core-v3/work/configure.log
make: *** [/root/robotpkg/mk/configure/cmake-configure.mk:100: do-configure-cmake] Error 1
make: *** [/root/robotpkg/mk/internal/trusted.mk:36: install] Error 2
Cleaning up project directory and file based variables
ERROR: Job failed: exit code 1

failed
robotpkg-sot-core-v3-ferrum Test
For details or bug reports, check the complete log file in:
/root/robotpkg/wip/sot-core-v3/work/configure.log

/root/robotpkg/mk/configure/cmake-configure.mk:100: recipe for target 'do-configure-cmake' failed
make: *** [do-configure-cmake] Error 1
/root/robotpkg/mk/internal/trusted.mk:36: recipe for target 'install' failed
make: *** [install] Error 2
Cleaning up project directory and file based variables
ERROR: Job failed: exit code 1

failed
robotpkg-sot-core-v3-20.04 Test
| See also "/root/robotpkg/wip/sot-core-v3/work/sot-core-4.11.6/CMakeFiles/CMakeOutput.log".
| See also "/root/robotpkg/wip/sot-core-v3/work/sot-core-4.11.6/CMakeFiles/CMakeError.log".
For details or bug reports, check the complete log file in:
/root/robotpkg/wip/sot-core-v3/work/configure.log

make: *** [/root/robotpkg/mk/configure/cmake-configure.mk:100: do-configure-cmake] Error 1
make: *** [/root/robotpkg/mk/internal/trusted.mk:36: install] Error 2
Cleaning up project directory and file based variables
ERROR: Job failed: exit code 1

failed
format Test
+                   out, err);

// Debug print.
runPythonCommand("print(\"Load device from C++ to Python... Done!!\")",
++ git diff --ignore-submodules
++ wc -l
+ exit 277
Cleaning up project directory and file based variables
ERROR: Job failed: exit code 1