[Tests] update testNaveau2015Online timeout

11 jobs for devel in 61 minutes (queued for 2 seconds)
Status Name Job ID Coverage
  Test
passed doc-coverage #74667

00:52:29

failed format #74668
allowed to fail

00:00:58

failed robotpkg-jrl-walkgen-v3-16.04-debug #74665
allowed to fail

00:01:41

failed robotpkg-jrl-walkgen-v3-16.04-release #74664
allowed to fail

00:01:40

passed robotpkg-jrl-walkgen-v3-18.04-debug #74666

00:50:41

passed robotpkg-jrl-walkgen-v3-18.04-release #74518

00:08:29

failed doc-coverage #74520

01:00:01

failed format #74521
allowed to fail

00:01:08

failed robotpkg-jrl-walkgen-v3-16.04-debug #74517
allowed to fail

00:01:56

failed robotpkg-jrl-walkgen-v3-16.04-release #74516
allowed to fail

00:01:48

failed robotpkg-jrl-walkgen-v3-18.04-debug #74519
allowed to fail

01:00:00

 
Name Stage Failure
failed
robotpkg-jrl-walkgen-v3-16.04-debug Test
For details or bug reports, check the complete log file in:
/root/robotpkg/wip/jrl-walkgen-v3/work.runner-sWwLEjyc-project-204-concurrent-0/build.log
/root/robotpkg/mk/build/build.mk:198: recipe for target 'do-build' failed
make: *** [do-build] Error 2
/root/robotpkg/mk/internal/trusted.mk:36: recipe for target 'install' failed
make: *** [install] Error 2
Running after_script
Uploading artifacts for failed job
ERROR: Job failed: exit code 1
failed
robotpkg-jrl-walkgen-v3-16.04-release Test
/root/robotpkg/wip/jrl-walkgen-v3/work.runner-jmN42dp2-project-204-concurrent-0/build.log

/root/robotpkg/mk/build/build.mk:198: recipe for target 'do-build' failed
make: *** [do-build] Error 2
make: *** [install] Error 2
/root/robotpkg/mk/internal/trusted.mk:36: recipe for target 'install' failed
Running after_script
Uploading artifacts for failed job
ERROR: Job failed: exit code 1
failed
format Test
-  bool sameFile2 =
- compareDebugFiles("TestRiccatiEquationWeightsWithInitialPose.dat");
+ bool sameFile2 = compareDebugFiles("TestRiccatiEquationWeightsWithInitialPose.dat");
delete anOCS;

if (sameFile && sameFile2) {
Running after_script
Uploading artifacts for failed job
ERROR: Job failed: exit code 1