v1.3.0

29 jobs for v1.3.0 in 1 minute and 38 seconds (queued for 6 seconds)
latest
Status Name Job ID Coverage
  Test
failed doc-coverage #80373

00:00:32

failed format #80449
allowed to fail

00:00:11

failed robotpkg-py-tsid-16.04-debug #80507
allowed to fail

00:00:32

failed robotpkg-py-tsid-16.04-release #80411
allowed to fail

00:00:31

failed robotpkg-py-tsid-18.04-debug #80366
allowed to fail

00:00:30

failed robotpkg-py-tsid-18.04-release #80424
allowed to fail

00:00:09

failed robotpkg-py-tsid-py3-16.04-debug #80441
allowed to fail

00:00:09

failed robotpkg-py-tsid-py3-16.04-release #80425
allowed to fail

00:00:09

failed robotpkg-py-tsid-py3-18.04-debug #80403

00:00:31

failed robotpkg-py-tsid-py3-18.04-release #80405

00:00:30

failed robotpkg-tsid-16.04-debug #80370

00:00:22

failed robotpkg-tsid-16.04-release #80421

00:00:28

failed robotpkg-tsid-18.04-debug #80372

00:00:22

failed robotpkg-tsid-18.04-release #80447

00:00:27

failed format #80423
allowed to fail

00:00:09

failed format #80374
allowed to fail

00:00:09

failed robotpkg-py-tsid-16.04-debug #80362
allowed to fail

00:01:07

failed robotpkg-py-tsid-16.04-release #80361
allowed to fail

00:00:23

failed robotpkg-py-tsid-18.04-release #80407
allowed to fail

00:00:09

failed robotpkg-py-tsid-18.04-release #80365
allowed to fail

00:00:21

failed robotpkg-py-tsid-py3-16.04-debug #80418
allowed to fail

00:00:09

failed robotpkg-py-tsid-py3-16.04-debug #80364
allowed to fail

00:00:25

failed robotpkg-py-tsid-py3-16.04-release #80412
allowed to fail

00:00:09

failed robotpkg-py-tsid-py3-16.04-release #80363
allowed to fail

00:00:23

failed robotpkg-py-tsid-py3-18.04-debug #80368

00:00:19

failed robotpkg-py-tsid-py3-18.04-release #80367

00:00:20

failed robotpkg-tsid-16.04-release #80369

00:00:09

failed robotpkg-tsid-18.04-release #80422

00:00:09

failed robotpkg-tsid-18.04-release #80371

00:00:09

 
Name Stage Failure
failed
robotpkg-py-tsid-16.04-debug Test

/root/robotpkg/mk/configure/cmake-configure.mk:100: recipe for target 'do-configure-cmake' failed
/root/robotpkg/mk/depends/depends.mk:70: recipe for target 'do-depends' failed
make: *** [do-depends] Error 1
make: *** [install] Error 2
/root/robotpkg/mk/internal/trusted.mk:36: recipe for target 'install' failed
Running after_script
Uploading artifacts for failed job
ERROR: Job failed: exit code 1
failed
robotpkg-tsid-18.04-release Test
/root/robotpkg/optimization/tsid/work.runner-ke6dzkhd-project-46-concurrent-3/configure.log

/root/robotpkg/mk/configure/cmake-configure.mk:100: recipe for target 'do-configure-cmake' failed
make: *** [do-configure-cmake] Error 1
/root/robotpkg/mk/internal/trusted.mk:36: recipe for target 'install' failed
make: *** [install] Error 2
Running after_script
Uploading artifacts for failed job
ERROR: Job failed: exit code 1
failed
format Test There has been a runner system failure, please try again
ERROR: Preparation failed: Cannot connect to the Docker daemon at unix:///var/run/docker.sock. Is the docker daemon running? (docker.go:989:0s)
Will be retried in 3s ...
ERROR: Removing network for build
ERROR: Preparation failed: Cannot connect to the Docker daemon at unix:///var/run/docker.sock. Is the docker daemon running? (docker.go:989:0s)
Will be retried in 3s ...
ERROR: Removing network for build
ERROR: Preparation failed: Cannot connect to the Docker daemon at unix:///var/run/docker.sock. Is the docker daemon running? (docker.go:989:0s)
Will be retried in 3s ...
ERROR: Job failed (system failure): Cannot connect to the Docker daemon at unix:///var/run/docker.sock. Is the docker daemon running? (docker.go:989:0s)
failed
robotpkg-py-tsid-py3-16.04-debug Test There has been a runner system failure, please try again
ERROR: Preparation failed: Cannot connect to the Docker daemon at unix:///var/run/docker.sock. Is the docker daemon running? (docker.go:989:0s)
Will be retried in 3s ...
ERROR: Removing network for build
ERROR: Preparation failed: Cannot connect to the Docker daemon at unix:///var/run/docker.sock. Is the docker daemon running? (docker.go:989:0s)
Will be retried in 3s ...
ERROR: Removing network for build
ERROR: Preparation failed: Cannot connect to the Docker daemon at unix:///var/run/docker.sock. Is the docker daemon running? (docker.go:989:0s)
Will be retried in 3s ...
ERROR: Job failed (system failure): Cannot connect to the Docker daemon at unix:///var/run/docker.sock. Is the docker daemon running? (docker.go:989:0s)
failed
robotpkg-tsid-16.04-release Test
/root/robotpkg/optimization/tsid/work.runner-ke6dzkhd-project-46-concurrent-6/configure.log

make: *** [do-configure-cmake] Error 1
/root/robotpkg/mk/configure/cmake-configure.mk:100: recipe for target 'do-configure-cmake' failed
/root/robotpkg/mk/internal/trusted.mk:36: recipe for target 'install' failed
make: *** [install] Error 2
Running after_script
Uploading artifacts for failed job
ERROR: Job failed: exit code 1
failed
robotpkg-py-tsid-py3-18.04-release Test
/root/robotpkg/mk/configure/cmake-configure.mk:100: recipe for target 'do-configure-cmake' failed
make[1]: *** [do-configure-cmake] Error 1
/root/robotpkg/mk/depends/depends.mk:70: recipe for target 'do-depends' failed
make: *** [do-depends] Error 1
/root/robotpkg/mk/internal/trusted.mk:36: recipe for target 'install' failed
make: *** [install] Error 2
Running after_script
Uploading artifacts for failed job
ERROR: Job failed: exit code 1
failed
robotpkg-py-tsid-18.04-release Test There has been a runner system failure, please try again
ERROR: Preparation failed: Cannot connect to the Docker daemon at unix:///var/run/docker.sock. Is the docker daemon running? (docker.go:989:0s)
Will be retried in 3s ...
ERROR: Removing network for build
ERROR: Preparation failed: Cannot connect to the Docker daemon at unix:///var/run/docker.sock. Is the docker daemon running? (docker.go:989:0s)
Will be retried in 3s ...
ERROR: Removing network for build
ERROR: Preparation failed: Cannot connect to the Docker daemon at unix:///var/run/docker.sock. Is the docker daemon running? (docker.go:989:0s)
Will be retried in 3s ...
ERROR: Job failed (system failure): Cannot connect to the Docker daemon at unix:///var/run/docker.sock. Is the docker daemon running? (docker.go:989:0s)
failed
robotpkg-py-tsid-16.04-release Test
/root/robotpkg/mk/configure/cmake-configure.mk:100: recipe for target 'do-configure-cmake' failed
make[1]: *** [do-configure-cmake] Error 1
/root/robotpkg/mk/depends/depends.mk:70: recipe for target 'do-depends' failed
make: *** [do-depends] Error 1
/root/robotpkg/mk/internal/trusted.mk:36: recipe for target 'install' failed
make: *** [install] Error 2
Running after_script
Uploading artifacts for failed job
ERROR: Job failed: exit code 1
failed
robotpkg-py-tsid-py3-18.04-debug Test
/root/robotpkg/mk/configure/cmake-configure.mk:100: recipe for target 'do-configure-cmake' failed
make[1]: *** [do-configure-cmake] Error 1
/root/robotpkg/mk/depends/depends.mk:70: recipe for target 'do-depends' failed
make: *** [do-depends] Error 1
/root/robotpkg/mk/internal/trusted.mk:36: recipe for target 'install' failed
make: *** [install] Error 2
Running after_script
Uploading artifacts for failed job
ERROR: Job failed: exit code 1
failed
doc-coverage Test
Running after script...
$ cd /root/robotpkg/optimization/py-tsid
$ build=$(make show-var VARNAME=CONFIGURE_DIRS); cd $(make show-var VARNAME=WRKSRC); cd $build
$ make doc
make: Nothing to be done for 'doc'.
$ mv doc/doxygen-html ${CI_PROJECT_DIR}
mv: cannot stat 'doc/doxygen-html': No such file or directory
Uploading artifacts for failed job
ERROR: Job failed: exit code 1
failed
robotpkg-py-tsid-18.04-debug Test
/root/robotpkg/mk/configure/cmake-configure.mk:100: recipe for target 'do-configure-cmake' failed
make[1]: *** [do-configure-cmake] Error 1
make: *** [do-depends] Error 1
/root/robotpkg/mk/depends/depends.mk:70: recipe for target 'do-depends' failed
make: *** [install] Error 2
/root/robotpkg/mk/internal/trusted.mk:36: recipe for target 'install' failed
Running after_script
Uploading artifacts for failed job
ERROR: Job failed: exit code 1
failed
robotpkg-tsid-18.04-debug Test
For details or bug reports, check the complete log file in:
/root/robotpkg/optimization/tsid/work.runner-qtz7nxce-project-46-concurrent-1/configure.log
make: *** [do-configure-cmake] Error 1
make: *** [install] Error 2
/root/robotpkg/mk/configure/cmake-configure.mk:100: recipe for target 'do-configure-cmake' failed
/root/robotpkg/mk/internal/trusted.mk:36: recipe for target 'install' failed
Running after_script
Uploading artifacts for failed job
ERROR: Job failed: exit code 1
failed
robotpkg-py-tsid-py3-16.04-release Test There has been a runner system failure, please try again
ERROR: Preparation failed: Cannot connect to the Docker daemon at unix:///var/run/docker.sock. Is the docker daemon running? (docker.go:989:0s)
Will be retried in 3s ...
ERROR: Removing network for build
ERROR: Preparation failed: Cannot connect to the Docker daemon at unix:///var/run/docker.sock. Is the docker daemon running? (docker.go:989:0s)
Will be retried in 3s ...
ERROR: Removing network for build
ERROR: Preparation failed: Cannot connect to the Docker daemon at unix:///var/run/docker.sock. Is the docker daemon running? (docker.go:989:0s)
Will be retried in 3s ...
ERROR: Job failed (system failure): Cannot connect to the Docker daemon at unix:///var/run/docker.sock. Is the docker daemon running? (docker.go:989:0s)
failed
robotpkg-tsid-16.04-debug Test
/root/robotpkg/optimization/tsid/work.runner-qtz7nxce-project-46-concurrent-0/configure.log

make: *** [do-configure-cmake] Error 1
/root/robotpkg/mk/configure/cmake-configure.mk:100: recipe for target 'do-configure-cmake' failed
/root/robotpkg/mk/internal/trusted.mk:36: recipe for target 'install' failed
make: *** [install] Error 2
Running after_script
Uploading artifacts for failed job
ERROR: Job failed: exit code 1