include pinocchio before boost

ref https://github.com/stack-of-tasks/pinocchio/issues/849
20 jobs for master in 31 minutes and 30 seconds (queued for 3 seconds)
Status Name Job ID Coverage
  Test
passed doc-coverage #62802

00:31:25

49.0%
failed format #62803
allowed to fail

00:05:01

passed robotpkg-py-tsid-16.04-debug #62785

00:07:14

passed robotpkg-py-tsid-16.04-release #62784

00:18:10

passed robotpkg-py-tsid-18.04-debug #62789

00:10:14

passed robotpkg-py-tsid-18.04-release #62788

00:09:15

failed robotpkg-py-tsid-py3-16.04-debug #62787
allowed to fail

00:05:08

failed robotpkg-py-tsid-py3-16.04-release #62786
allowed to fail

00:00:30

failed robotpkg-py-tsid-py3-18.04-debug #62791
allowed to fail

00:05:02

failed robotpkg-py-tsid-py3-18.04-release #62790
allowed to fail

00:05:04

failed robotpkg-py-tsid-py3-stretch-debug #62795
allowed to fail

00:05:01

failed robotpkg-py-tsid-py3-stretch-release #62794
allowed to fail

00:05:03

passed robotpkg-py-tsid-stretch-debug #62793

00:27:43

passed robotpkg-py-tsid-stretch-release #62792

00:25:36

passed robotpkg-tsid-16.04-debug #62796

00:12:00

passed robotpkg-tsid-16.04-release #62797

00:10:12

passed robotpkg-tsid-18.04-debug #62799

00:14:45

passed robotpkg-tsid-18.04-release #62798

00:12:58

passed robotpkg-tsid-stretch-debug #62801

00:14:55

passed robotpkg-tsid-stretch-release #62800

00:12:54

 
Name Stage Failure
failed
robotpkg-py-tsid-py3-16.04-debug Test
For details or bug reports, check the complete log file in:
/root/robotpkg/wip/tsid/work.runner-7gqkM7SY-project-46-concurrent-1/configure.log
make[1]: *** [do-configure-cmake] Error 1
/root/robotpkg/mk/configure/cmake-configure.mk:100: recipe for target 'do-configure-cmake' failed
make: *** [do-depends] Error 1
/root/robotpkg/mk/depends/depends.mk:70: recipe for target 'do-depends' failed
/root/robotpkg/mk/internal/trusted.mk:36: recipe for target 'install' failed
make: *** [install] Error 2
ERROR: Job failed: exit code 1
failed
format Test
   getProfiler().report_all(3, cout);
getStatistics().report_all(1, cout);
}

-
-
-BOOST_AUTO_TEST_SUITE_END ()
+BOOST_AUTO_TEST_SUITE_END()
ERROR: Job failed: exit code 1
failed
robotpkg-py-tsid-py3-18.04-release Test
For details or bug reports, check the complete log file in:
/root/robotpkg/wip/tsid/work.runner-7gqkM7SY-project-46-concurrent-2/configure.log
make[1]: *** [do-configure-cmake] Error 1
/root/robotpkg/mk/configure/cmake-configure.mk:100: recipe for target 'do-configure-cmake' failed
/root/robotpkg/mk/depends/depends.mk:70: recipe for target 'do-depends' failed
make: *** [do-depends] Error 1
make: *** [install] Error 2
/root/robotpkg/mk/internal/trusted.mk:36: recipe for target 'install' failed
ERROR: Job failed: exit code 1
failed
robotpkg-py-tsid-py3-stretch-release Test
For details or bug reports, check the complete log file in:
/root/robotpkg/wip/tsid/work.runner-7gqkM7SY-project-46-concurrent-6/configure.log
/root/robotpkg/mk/configure/cmake-configure.mk:100: recipe for target 'do-configure-cmake' failed
make[1]: *** [do-configure-cmake] Error 1
make: *** [do-depends] Error 1
/root/robotpkg/mk/depends/depends.mk:70: recipe for target 'do-depends' failed
/root/robotpkg/mk/internal/trusted.mk:36: recipe for target 'install' failed
make: *** [install] Error 2
ERROR: Job failed: exit code 1
failed
robotpkg-py-tsid-py3-18.04-debug Test
For details or bug reports, check the complete log file in:
/root/robotpkg/wip/tsid/work.runner-7gqkM7SY-project-46-concurrent-3/configure.log
make[1]: *** [do-configure-cmake] Error 1
/root/robotpkg/mk/configure/cmake-configure.mk:100: recipe for target 'do-configure-cmake' failed
/root/robotpkg/mk/depends/depends.mk:70: recipe for target 'do-depends' failed
make: *** [do-depends] Error 1
/root/robotpkg/mk/internal/trusted.mk:36: recipe for target 'install' failed
make: *** [install] Error 2
ERROR: Job failed: exit code 1
failed
robotpkg-py-tsid-py3-stretch-debug Test
For details or bug reports, check the complete log file in:
/root/robotpkg/wip/tsid/work.runner-7gqkM7SY-project-46-concurrent-7/configure.log
/root/robotpkg/mk/configure/cmake-configure.mk:100: recipe for target 'do-configure-cmake' failed
make[1]: *** [do-configure-cmake] Error 1
make: *** [do-depends] Error 1
/root/robotpkg/mk/depends/depends.mk:70: recipe for target 'do-depends' failed
make: *** [install] Error 2
/root/robotpkg/mk/internal/trusted.mk:36: recipe for target 'install' failed
ERROR: Job failed: exit code 1
failed
robotpkg-py-tsid-py3-16.04-release Test
/root/robotpkg/wip/tsid/work.runner-sWwLEjyc-project-46-concurrent-1/configure.log

/root/robotpkg/mk/configure/cmake-configure.mk:100: recipe for target 'do-configure-cmake' failed
make[1]: *** [do-configure-cmake] Error 1
make: *** [do-depends] Error 1
/root/robotpkg/mk/depends/depends.mk:70: recipe for target 'do-depends' failed
make: *** [install] Error 2
/root/robotpkg/mk/internal/trusted.mk:36: recipe for target 'install' failed
ERROR: Job failed: exit code 1