v2.0.0

6 jobs for master in 2 minutes and 23 seconds (queued for 1 second)
latest
Name Stage Failure
failed
robotpkg-talos-data-18.04 Test
For details or bug reports, check the complete log file in:
/root/robotpkg/wip/talos-data/work/extract.log

/root/robotpkg/mk/extract/checkout.mk:225: recipe for target 'do-checkout' failed
make: *** [do-checkout] Error 1
make: *** [checkout] Error 2
/root/robotpkg/mk/internal/trusted.mk:36: recipe for target 'checkout' failed
Cleaning up project directory and file based variables
ERROR: Job failed: exit code 1

failed
robotpkg-talos-data-ferrum Test
For details or bug reports, check the complete log file in:
/root/robotpkg/wip/talos-data/work/extract.log

/root/robotpkg/mk/extract/checkout.mk:225: recipe for target 'do-checkout' failed
make: *** [do-checkout] Error 1
/root/robotpkg/mk/internal/trusted.mk:36: recipe for target 'checkout' failed
make: *** [checkout] Error 2
Cleaning up project directory and file based variables
ERROR: Job failed: exit code 1

failed
doc-coverage Test
make: *** [/root/robotpkg/mk/internal/trusted.mk:36: checkout] Error 2
Running after_script
Running after script...
$ cd /root/robotpkg/wip/talos-data
$ build=$(make show-var VARNAME=CONFIGURE_DIRS); cd $(make show-var VARNAME=WRKSRC); cd $build
$ make doc
make: *** No rule to make target 'doc'. Stop.
Cleaning up project directory and file based variables
ERROR: Job failed: exit code 1

failed
robotpkg-talos-data-buster Test
| fatal: clone of 'git://github.com/jrl-umi3218/jrl-cmakemodules.git' into submodule path '/root/robotpkg/wip/talos-data/work/talos_data-2.0.0/cmake' failed
| Failed to clone 'cmake' a second time, aborting

For details or bug reports, check the complete log file in:
/root/robotpkg/wip/talos-data/work/extract.log
make: *** [/root/robotpkg/mk/extract/checkout.mk:226: do-checkout] Error 1
make: *** [/root/robotpkg/mk/internal/trusted.mk:36: checkout] Error 2
Cleaning up project directory and file based variables
ERROR: Job failed: exit code 1

failed
robotpkg-talos-data-20.04 Test
| fatal: clone of 'git://github.com/jrl-umi3218/jrl-cmakemodules.git' into submodule path '/root/robotpkg/wip/talos-data/work/talos_data-2.0.0/cmake' failed
| Failed to clone 'cmake' a second time, aborting

For details or bug reports, check the complete log file in:
/root/robotpkg/wip/talos-data/work/extract.log
make: *** [/root/robotpkg/mk/extract/checkout.mk:226: do-checkout] Error 1
make: *** [/root/robotpkg/mk/internal/trusted.mk:36: checkout] Error 2
Cleaning up project directory and file based variables
ERROR: Job failed: exit code 1