v1.6.0

9 jobs for pr/78 in 1 minute and 41 seconds (queued for 1 second)
Status Name Job ID Coverage
  Test
failed doc-coverage #89563

00:01:19

failed format #89564
allowed to fail

00:01:01

failed robotpkg-py-sot-torque-control-py2-18.04-release #89557

00:01:13

failed robotpkg-py-sot-torque-control-py3-16.04-release #89556
allowed to fail

00:01:41

failed robotpkg-py-sot-torque-control-py3-18.04-release #89558
allowed to fail

00:01:16

failed robotpkg-py-sot-torque-control-py3-20.04-release #89559

00:01:11

failed robotpkg-py-sot-torque-control-py3-buster-release #89560

00:01:15

failed robotpkg-py-sot-torque-control-py3-stretch-release #89561
allowed to fail

00:01:18

failed robotpkg-sot-torque-control-18.04-release #89562

00:01:06

 
Name Stage Failure
failed
robotpkg-py-sot-torque-control-py3-16.04-release Test
/root/robotpkg/wip/sot-torque-control/work.runner-5nsakv6-project-48-concurrent-3/configure.log

make[1]: *** [do-configure-cmake] Error 1
/root/robotpkg/mk/configure/cmake-configure.mk:100: recipe for target 'do-configure-cmake' failed
make: *** [do-depends] Error 1
/root/robotpkg/mk/depends/depends.mk:70: recipe for target 'do-depends' failed
make: *** [install] Error 2
/root/robotpkg/mk/internal/trusted.mk:36: recipe for target 'install' failed
ERROR: Job failed: exit code 1
failed
robotpkg-py-sot-torque-control-py3-stretch-release Test
/root/robotpkg/wip/sot-torque-control/work.runner-swwlejyc-project-48-concurrent-6/configure.log

/root/robotpkg/mk/configure/cmake-configure.mk:100: recipe for target 'do-configure-cmake' failed
make[1]: *** [do-configure-cmake] Error 1
make: *** [do-depends] Error 1
/root/robotpkg/mk/depends/depends.mk:70: recipe for target 'do-depends' failed
make: *** [install] Error 2
/root/robotpkg/mk/internal/trusted.mk:36: recipe for target 'install' failed
ERROR: Job failed: exit code 1
failed
robotpkg-py-sot-torque-control-py3-18.04-release Test
For details or bug reports, check the complete log file in:
/root/robotpkg/wip/sot-torque-control/work.runner-swwlejyc-project-48-concurrent-3/configure.log
/root/robotpkg/mk/configure/cmake-configure.mk:100: recipe for target 'do-configure-cmake' failed
make[1]: *** [do-configure-cmake] Error 1
/root/robotpkg/mk/depends/depends.mk:70: recipe for target 'do-depends' failed
make: *** [do-depends] Error 1
/root/robotpkg/mk/internal/trusted.mk:36: recipe for target 'install' failed
make: *** [install] Error 2
ERROR: Job failed: exit code 1
failed
robotpkg-py-sot-torque-control-py3-buster-release Test
| See also "/root/robotpkg/wip/sot-torque-control/work.runner-swwlejyc-project-48-concurrent-5/sot-torque-control-1.5.3/CMakeFiles/CMakeOutput.log".
| See also "/root/robotpkg/wip/sot-torque-control/work.runner-swwlejyc-project-48-concurrent-5/sot-torque-control-1.5.3/CMakeFiles/CMakeError.log".
For details or bug reports, check the complete log file in:
/root/robotpkg/wip/sot-torque-control/work.runner-swwlejyc-project-48-concurrent-5/configure.log

make[1]: *** [/root/robotpkg/mk/configure/cmake-configure.mk:100: do-configure-cmake] Error 1
make: *** [/root/robotpkg/mk/depends/depends.mk:70: do-depends] Error 1
make: *** [/root/robotpkg/mk/internal/trusted.mk:36: install] Error 2
ERROR: Job failed: exit code 1
failed
robotpkg-py-sot-torque-control-py2-18.04-release Test
For details or bug reports, check the complete log file in:
/root/robotpkg/wip/sot-torque-control/work.runner-swwlejyc-project-48-concurrent-2/configure.log
make[1]: *** [do-configure-cmake] Error 1
/root/robotpkg/mk/configure/cmake-configure.mk:100: recipe for target 'do-configure-cmake' failed
make: *** [do-depends] Error 1
/root/robotpkg/mk/depends/depends.mk:70: recipe for target 'do-depends' failed
/root/robotpkg/mk/internal/trusted.mk:36: recipe for target 'install' failed
make: *** [install] Error 2
ERROR: Job failed: exit code 1
failed
doc-coverage Test
Running after_script
Running after script...
$ cd /root/robotpkg/wip/py-sot-torque-control
$ build=$(make show-var VARNAME=CONFIGURE_DIRS); cd $(make show-var VARNAME=WRKSRC); cd $build
$ make doc
make: Nothing to be done for 'doc'.
$ mv doc/doxygen-html ${CI_PROJECT_DIR}
mv: cannot stat 'doc/doxygen-html': No such file or directory
ERROR: Job failed: exit code 1
failed
robotpkg-py-sot-torque-control-py3-20.04-release Test
| See also "/root/robotpkg/wip/sot-torque-control/work.runner-swwlejyc-project-48-concurrent-4/sot-torque-control-1.5.3/CMakeFiles/CMakeOutput.log".
| See also "/root/robotpkg/wip/sot-torque-control/work.runner-swwlejyc-project-48-concurrent-4/sot-torque-control-1.5.3/CMakeFiles/CMakeError.log".

For details or bug reports, check the complete log file in:
/root/robotpkg/wip/sot-torque-control/work.runner-swwlejyc-project-48-concurrent-4/configure.log
make[1]: *** [/root/robotpkg/mk/configure/cmake-configure.mk:100: do-configure-cmake] Error 1
make: *** [/root/robotpkg/mk/depends/depends.mk:70: do-depends] Error 1
make: *** [/root/robotpkg/mk/internal/trusted.mk:36: install] Error 2
ERROR: Job failed: exit code 1
failed
robotpkg-sot-torque-control-18.04-release Test
| See also "/root/robotpkg/wip/sot-torque-control/work.runner-swwlejyc-project-48-concurrent-7/sot-torque-control-1.5.3/CMakeFiles/CMakeError.log".
For details or bug reports, check the complete log file in:
/root/robotpkg/wip/sot-torque-control/work.runner-swwlejyc-project-48-concurrent-7/configure.log

/root/robotpkg/mk/configure/cmake-configure.mk:100: recipe for target 'do-configure-cmake' failed
make: *** [do-configure-cmake] Error 1
/root/robotpkg/mk/internal/trusted.mk:36: recipe for target 'install' failed
make: *** [install] Error 2
ERROR: Job failed: exit code 1
failed
format Test
index c0761ad..3a7743c 100644
--- a/src/trace-player-python.hh
+++ b/src/trace-player-python.hh
@@ -1,3 +1,3 @@
#include "sot/torque_control/trace-player.hh"

-typedef boost::mpl::vector< dynamicgraph::sot::torque_control::TracePlayer > entities_t;
+typedef boost::mpl::vector<dynamicgraph::sot::torque_control::TracePlayer> entities_t;
ERROR: Job failed: exit code 1