v1.3.0

6 jobs for master in 2 minutes and 37 seconds (queued for 1 second)
latest
Name Stage Failure
failed
robotpkg-py-sot-talos-buster Test
| fatal: clone of 'git://github.com/jrl-umi3218/jrl-cmakemodules.git' into submodule path '/root/robotpkg/wip/py-sot-talos/work/sot-talos-1.3.0/cmake' failed
| Failed to clone 'cmake' a second time, aborting
For details or bug reports, check the complete log file in:
/root/robotpkg/wip/py-sot-talos/work/extract.log

make: *** [/root/robotpkg/mk/extract/checkout.mk:226: do-checkout] Error 1
make: *** [/root/robotpkg/mk/internal/trusted.mk:36: checkout] Error 2
Cleaning up project directory and file based variables
ERROR: Job failed: exit code 1

failed
doc-coverage Test
Running after script...
$ cd /root/robotpkg/wip/py-sot-talos
$ build=$(make show-var VARNAME=CONFIGURE_DIRS); cd $(make show-var VARNAME=WRKSRC); cd $build
$ make doc
make: Nothing to be done for 'doc'.
$ mv doc/doxygen-html ${CI_PROJECT_DIR}
mv: cannot stat 'doc/doxygen-html': No such file or directory
Cleaning up project directory and file based variables
ERROR: Job failed: exit code 1

failed
robotpkg-py-sot-talos-20.04 Test
| fatal: clone of 'git://github.com/jrl-umi3218/jrl-cmakemodules.git' into submodule path '/root/robotpkg/wip/py-sot-talos/work/sot-talos-1.3.0/cmake' failed
| Failed to clone 'cmake' a second time, aborting

For details or bug reports, check the complete log file in:
/root/robotpkg/wip/py-sot-talos/work/extract.log
make: *** [/root/robotpkg/mk/extract/checkout.mk:226: do-checkout] Error 1
make: *** [/root/robotpkg/mk/internal/trusted.mk:36: checkout] Error 2
Cleaning up project directory and file based variables
ERROR: Job failed: exit code 1

failed
format Test
+ shift
+ [[ 0 -gt 0 ]]
+ true
+ find . -path ./cmake -prune -o -iregex '.*\.\(h\|c\|hh\|cc\|hpp\|cpp\|hxx\|cxx\)$' -exec clang-format-6.0 -i '{}' +
+ true
+ flake8 .
./src/dynamic_graph/sot/talos/talos.py:69:22: E225 missing whitespace around operator
Cleaning up project directory and file based variables
ERROR: Job failed: exit code 1

failed
robotpkg-py-sot-talos-18.04 Test

For details or bug reports, check the complete log file in:
/root/robotpkg/wip/py-sot-talos/work/extract.log
make: *** [do-checkout] Error 1
/root/robotpkg/mk/extract/checkout.mk:225: recipe for target 'do-checkout' failed
/root/robotpkg/mk/internal/trusted.mk:36: recipe for target 'checkout' failed
make: *** [checkout] Error 2
Cleaning up project directory and file based variables
ERROR: Job failed: exit code 1

failed
robotpkg-py-sot-talos-ferrum Test

For details or bug reports, check the complete log file in:
/root/robotpkg/wip/py-sot-talos/work/extract.log
/root/robotpkg/mk/extract/checkout.mk:225: recipe for target 'do-checkout' failed
make: *** [do-checkout] Error 1
/root/robotpkg/mk/internal/trusted.mk:36: recipe for target 'checkout' failed
make: *** [checkout] Error 2
Cleaning up project directory and file based variables
ERROR: Job failed: exit code 1