module initialization compatible with python 2 & 3

20 jobs for master in 10 minutes and 49 seconds (queued for 2 seconds)
Status Name Job ID Coverage
  Test
passed doc-coverage #56758

00:10:41

100.0%
failed format #56759
allowed to fail

00:01:52

passed robotpkg-py-sot-dynamic-pinocchio-v3-16.04-debug #56741

00:03:27

passed robotpkg-py-sot-dynamic-pinocchio-v3-16.04-release #56742

00:07:59

passed robotpkg-py-sot-dynamic-pinocchio-v3-18.04-debug #56745

00:04:18

passed robotpkg-py-sot-dynamic-pinocchio-v3-18.04-release #56744

00:10:01

passed robotpkg-py-sot-dynamic-pinocchio-v3-py3-16.04-debug #56743

00:03:29

passed robotpkg-py-sot-dynamic-pinocchio-v3-py3-16.04-release #56740

00:03:13

passed robotpkg-py-sot-dynamic-pinocchio-v3-py3-18.04-debug #56747

00:10:32

passed robotpkg-py-sot-dynamic-pinocchio-v3-py3-18.04-release #56746

00:05:05

failed robotpkg-py-sot-dynamic-pinocchio-v3-py3-stretch-debug #56749
allowed to fail

00:10:45

failed robotpkg-py-sot-dynamic-pinocchio-v3-py3-stretch-release #56748
allowed to fail

00:05:07

failed robotpkg-py-sot-dynamic-pinocchio-v3-stretch-debug #56751
allowed to fail

00:10:36

failed robotpkg-py-sot-dynamic-pinocchio-v3-stretch-release #56750
allowed to fail

00:05:13

passed robotpkg-sot-dynamic-pinocchio-v3-16.04-debug #56752

00:02:24

passed robotpkg-sot-dynamic-pinocchio-v3-16.04-release #56753

00:04:25

passed robotpkg-sot-dynamic-pinocchio-v3-18.04-debug #56755

00:02:50

passed robotpkg-sot-dynamic-pinocchio-v3-18.04-release #56754

00:05:26

passed robotpkg-sot-dynamic-pinocchio-v3-stretch-debug #56757

00:03:02

passed robotpkg-sot-dynamic-pinocchio-v3-stretch-release #56756

00:05:30

 
Name Stage Failure
failed
robotpkg-py-sot-dynamic-pinocchio-v3-py3-stretch-debug Test
| make: *** [all] Error 2
For details or bug reports, check the complete log file in:
/root/robotpkg/wip/py-sot-dynamic-pinocchio-v3/work.runner-7gqkM7SY-project-198-concurrent-3/build.log

/root/robotpkg/mk/build/build.mk:198: recipe for target 'do-build' failed
make: *** [do-build] Error 2
make: *** [install] Error 2
/root/robotpkg/mk/internal/trusted.mk:36: recipe for target 'install' failed
ERROR: Job failed: exit code 1
failed
robotpkg-py-sot-dynamic-pinocchio-v3-stretch-debug Test
| Makefile:141: recipe for target 'all' failed
For details or bug reports, check the complete log file in:
/root/robotpkg/wip/py-sot-dynamic-pinocchio-v3/work.runner-7gqkM7SY-project-198-concurrent-4/build.log

/root/robotpkg/mk/build/build.mk:198: recipe for target 'do-build' failed
make: *** [do-build] Error 2
/root/robotpkg/mk/internal/trusted.mk:36: recipe for target 'install' failed
make: *** [install] Error 2
ERROR: Job failed: exit code 1
failed
robotpkg-py-sot-dynamic-pinocchio-v3-stretch-release Test
| make: *** [all] Error 2

For details or bug reports, check the complete log file in:
/root/robotpkg/wip/py-sot-dynamic-pinocchio-v3/work.runner-ULfN9w-c-project-198-concurrent-2/build.log
/root/robotpkg/mk/build/build.mk:198: recipe for target 'do-build' failed
make: *** [do-build] Error 2
/root/robotpkg/mk/internal/trusted.mk:36: recipe for target 'install' failed
make: *** [install] Error 2
ERROR: Job failed: exit code 1
failed
robotpkg-py-sot-dynamic-pinocchio-v3-py3-stretch-release Test
| make: *** [all] Error 2
For details or bug reports, check the complete log file in:
/root/robotpkg/wip/py-sot-dynamic-pinocchio-v3/work.runner-ULfN9w-c-project-198-concurrent-1/build.log

/root/robotpkg/mk/build/build.mk:198: recipe for target 'do-build' failed
make: *** [do-build] Error 2
make: *** [install] Error 2
/root/robotpkg/mk/internal/trusted.mk:36: recipe for target 'install' failed
ERROR: Job failed: exit code 1
failed
format Test
 #define INITERROR return NULL
#else
#define INITERROR return
@@ -136,4 +128,3 @@ void initwrap(void)
#ifdef __cplusplus
} // extern "C"
#endif
-
ERROR: Job failed: exit code 1