module initialization compatible with python 2 & 3

20 jobs for master in 10 minutes and 49 seconds (queued for 2 seconds)
Name Stage Failure
failed
robotpkg-py-sot-dynamic-pinocchio-v3-py3-stretch-release Test
| make: *** [all] Error 2
For details or bug reports, check the complete log file in:
/root/robotpkg/wip/py-sot-dynamic-pinocchio-v3/work.runner-ULfN9w-c-project-198-concurrent-1/build.log

/root/robotpkg/mk/build/build.mk:198: recipe for target 'do-build' failed
make: *** [do-build] Error 2
make: *** [install] Error 2
/root/robotpkg/mk/internal/trusted.mk:36: recipe for target 'install' failed
ERROR: Job failed: exit code 1
failed
robotpkg-py-sot-dynamic-pinocchio-v3-stretch-release Test
| make: *** [all] Error 2

For details or bug reports, check the complete log file in:
/root/robotpkg/wip/py-sot-dynamic-pinocchio-v3/work.runner-ULfN9w-c-project-198-concurrent-2/build.log
/root/robotpkg/mk/build/build.mk:198: recipe for target 'do-build' failed
make: *** [do-build] Error 2
/root/robotpkg/mk/internal/trusted.mk:36: recipe for target 'install' failed
make: *** [install] Error 2
ERROR: Job failed: exit code 1
failed
robotpkg-py-sot-dynamic-pinocchio-v3-py3-stretch-debug Test
| make: *** [all] Error 2
For details or bug reports, check the complete log file in:
/root/robotpkg/wip/py-sot-dynamic-pinocchio-v3/work.runner-7gqkM7SY-project-198-concurrent-3/build.log

/root/robotpkg/mk/build/build.mk:198: recipe for target 'do-build' failed
make: *** [do-build] Error 2
make: *** [install] Error 2
/root/robotpkg/mk/internal/trusted.mk:36: recipe for target 'install' failed
ERROR: Job failed: exit code 1
failed
robotpkg-py-sot-dynamic-pinocchio-v3-stretch-debug Test
| Makefile:141: recipe for target 'all' failed
For details or bug reports, check the complete log file in:
/root/robotpkg/wip/py-sot-dynamic-pinocchio-v3/work.runner-7gqkM7SY-project-198-concurrent-4/build.log

/root/robotpkg/mk/build/build.mk:198: recipe for target 'do-build' failed
make: *** [do-build] Error 2
/root/robotpkg/mk/internal/trusted.mk:36: recipe for target 'install' failed
make: *** [install] Error 2
ERROR: Job failed: exit code 1
failed
format Test
 #define INITERROR return NULL
#else
#define INITERROR return
@@ -136,4 +128,3 @@ void initwrap(void)
#ifdef __cplusplus
} // extern "C"
#endif
-
ERROR: Job failed: exit code 1