v3.6.0

9 jobs for v3.6.0 in 8 minutes and 28 seconds (queued for 11 seconds)
latest
Status Name Job ID Coverage
  Test
failed doc-coverage #98405

00:00:22

failed format #98408
allowed to fail

00:00:15

failed robotpkg-py-sot-dynamic-pinocchio-v3-py2-18.04-release #98395

00:00:45

failed robotpkg-py-sot-dynamic-pinocchio-v3-py3-16.04-release #98391
allowed to fail

00:00:42

failed robotpkg-py-sot-dynamic-pinocchio-v3-py3-18.04-release #98392
allowed to fail

00:00:39

passed robotpkg-py-sot-dynamic-pinocchio-v3-py3-20.04-release #98396

00:05:12

passed robotpkg-py-sot-dynamic-pinocchio-v3-py3-buster-release #98399

00:04:29

passed robotpkg-py-sot-dynamic-pinocchio-v3-py3-stretch-release #98401

00:08:02

failed robotpkg-sot-dynamic-pinocchio-v3-18.04-release #98403

00:00:29

 
Name Stage Failure
failed
robotpkg-sot-dynamic-pinocchio-v3-18.04-release Test
ERROR:
ERROR: See /root/robotpkg/wip/sot-dynamic-pinocchio-v3/work.runner-ke6dzkhd-project-198-concurrent-1/sysdep.log for details.
ERROR: ======================================================================
make: *** [do-depends] Error 1
/root/robotpkg/mk/depends/depends.mk:70: recipe for target 'do-depends' failed
/root/robotpkg/mk/internal/trusted.mk:36: recipe for target 'install' failed
make: *** [install] Error 2
Cleaning up file based variables
ERROR: Job failed: exit code 1
failed
robotpkg-py-sot-dynamic-pinocchio-v3-py3-16.04-release Test
ERROR: ======================================================================
=> Required system package urdfdom>=0.2.8: urdfdom-0.4.0 found
make: *** [do-depends] Error 1
/root/robotpkg/mk/depends/depends.mk:70: recipe for target 'do-depends' failed
/root/robotpkg/mk/internal/trusted.mk:36: recipe for target 'install' failed
make: *** [install] Error 2
Running after_script
Uploading artifacts for failed job
ERROR: Job failed: exit code 1
failed
doc-coverage Test
Running after script...
$ cd /root/robotpkg/wip/py-sot-dynamic-pinocchio-v3
$ build=$(make show-var VARNAME=CONFIGURE_DIRS); cd $(make show-var VARNAME=WRKSRC); cd $build
$ make doc
make: Nothing to be done for 'doc'.
$ mv doc/doxygen-html ${CI_PROJECT_DIR}
mv: cannot stat 'doc/doxygen-html': No such file or directory
Cleaning up file based variables
ERROR: Job failed: exit code 1
failed
format Test
--- a/src/zmp-from-forces-python.hh
+++ b/src/zmp-from-forces-python.hh
@@ -1,3 +1,3 @@
#include "zmp-from-forces.h"

-typedef boost::mpl::vector< sot::dynamic::ZmpFromForces > entities_t;
+typedef boost::mpl::vector<sot::dynamic::ZmpFromForces> entities_t;
Cleaning up file based variables
ERROR: Job failed: exit code 1
failed
robotpkg-py-sot-dynamic-pinocchio-v3-py3-18.04-release Test
ERROR:
ERROR: See /root/robotpkg/wip/py-sot-dynamic-pinocchio-v3/work.runner-jmn42dp2-project-198-concurrent-2/sysdep.log for details.
ERROR: ======================================================================
make: *** [do-depends] Error 1
/root/robotpkg/mk/depends/depends.mk:70: recipe for target 'do-depends' failed
/root/robotpkg/mk/internal/trusted.mk:36: recipe for target 'install' failed
make: *** [install] Error 2
Cleaning up file based variables
ERROR: Job failed: exit code 1
failed
robotpkg-py-sot-dynamic-pinocchio-v3-py2-18.04-release Test
ERROR:
ERROR: See /root/robotpkg/wip/py-sot-dynamic-pinocchio-v3/work.runner-swwlejyc-project-198-concurrent-1/sysdep.log for details.
ERROR: ======================================================================
/root/robotpkg/mk/depends/depends.mk:70: recipe for target 'do-depends' failed
make: *** [do-depends] Error 1
make: *** [install] Error 2
/root/robotpkg/mk/internal/trusted.mk:36: recipe for target 'install' failed
Cleaning up file based variables
ERROR: Job failed: exit code 1