Merge branch 'master' into devel

9 jobs for devel in 10 minutes and 41 seconds (queued for 9 seconds)
Status Name Job ID Coverage
  Test
failed doc-coverage #98368

00:00:43

failed format #98371
allowed to fail

00:00:42

failed robotpkg-py-sot-dynamic-pinocchio-v3-py2-18.04-release #98358

00:00:41

failed robotpkg-py-sot-dynamic-pinocchio-v3-py3-16.04-release #98355
allowed to fail

00:01:31

failed robotpkg-py-sot-dynamic-pinocchio-v3-py3-18.04-release #98356
allowed to fail

00:00:35

passed robotpkg-py-sot-dynamic-pinocchio-v3-py3-20.04-release #98360

00:08:49

passed robotpkg-py-sot-dynamic-pinocchio-v3-py3-buster-release #98361

00:10:33

passed robotpkg-py-sot-dynamic-pinocchio-v3-py3-stretch-release #98364

00:06:26

failed robotpkg-sot-dynamic-pinocchio-v3-18.04-release #98366

00:00:40

 
Name Stage Failure
failed
robotpkg-py-sot-dynamic-pinocchio-v3-py3-16.04-release Test
ERROR: you can configure robotpkg.conf to use this version instead.
ERROR:
ERROR: See /root/robotpkg/wip/py-sot-dynamic-pinocchio-v3/work.runner-5nsakv6-project-198-concurrent-0/sysdep.log for details.
ERROR: ======================================================================
/root/robotpkg/mk/depends/depends.mk:70: recipe for target 'do-depends' failed
make: *** [do-depends] Error 1
make: *** [install] Error 2
/root/robotpkg/mk/internal/trusted.mk:36: recipe for target 'install' failed
ERROR: Job failed: exit code 1
failed
robotpkg-py-sot-dynamic-pinocchio-v3-py3-18.04-release Test
ERROR:
ERROR: See /root/robotpkg/wip/py-sot-dynamic-pinocchio-v3/work.runner-jmn42dp2-project-198-concurrent-0/sysdep.log for details.
ERROR: ======================================================================
/root/robotpkg/mk/depends/depends.mk:70: recipe for target 'do-depends' failed
make: *** [do-depends] Error 1
/root/robotpkg/mk/internal/trusted.mk:36: recipe for target 'install' failed
make: *** [install] Error 2
Cleaning up file based variables
ERROR: Job failed: exit code 1
failed
format Test
--- a/src/zmp-from-forces-python.hh
+++ b/src/zmp-from-forces-python.hh
@@ -1,3 +1,3 @@
#include "zmp-from-forces.h"

-typedef boost::mpl::vector< sot::dynamic::ZmpFromForces > entities_t;
+typedef boost::mpl::vector<sot::dynamic::ZmpFromForces> entities_t;
Cleaning up file based variables
ERROR: Job failed: exit code 1
failed
doc-coverage Test
Running after script...
$ cd /root/robotpkg/wip/py-sot-dynamic-pinocchio-v3
$ build=$(make show-var VARNAME=CONFIGURE_DIRS); cd $(make show-var VARNAME=WRKSRC); cd $build
$ make doc
make: Nothing to be done for 'doc'.
$ mv doc/doxygen-html ${CI_PROJECT_DIR}
mv: cannot stat 'doc/doxygen-html': No such file or directory
Cleaning up file based variables
ERROR: Job failed: exit code 1
failed
robotpkg-py-sot-dynamic-pinocchio-v3-py2-18.04-release Test
ERROR: See /root/robotpkg/wip/py-sot-dynamic-pinocchio-v3/work.runner-swwlejyc-project-198-concurrent-0/sysdep.log for details.
ERROR: ======================================================================
=> Required system package urdfdom>=0.2.8: urdfdom-1.0.0 found
make: *** [do-depends] Error 1
/root/robotpkg/mk/depends/depends.mk:70: recipe for target 'do-depends' failed
make: *** [install] Error 2
/root/robotpkg/mk/internal/trusted.mk:36: recipe for target 'install' failed
Cleaning up file based variables
ERROR: Job failed: exit code 1
failed
robotpkg-sot-dynamic-pinocchio-v3-18.04-release Test
ERROR: See /root/robotpkg/wip/sot-dynamic-pinocchio-v3/work.runner-qtz7nxce-project-198-concurrent-0/sysdep.log for details.
ERROR: ======================================================================
make: *** [do-depends] Error 1
/root/robotpkg/mk/depends/depends.mk:70: recipe for target 'do-depends' failed
/root/robotpkg/mk/internal/trusted.mk:36: recipe for target 'install' failed
make: *** [install] Error 2
Running after_script
Uploading artifacts for failed job
ERROR: Job failed: exit code 1