v3.6.0

9 jobs for pr/80 in 7 minutes and 14 seconds (queued for 1 second)
Status Job ID Name Coverage
  Test
failed #89340
doc-coverage

00:03:41

0.0%
failed #89341
allowed to fail
format

00:00:10

failed #89335
robotpkg-py-sot-dynamic-pinocchio-v3-py2-18.04-release

00:06:10

failed #89333
allowed to fail
robotpkg-py-sot-dynamic-pinocchio-v3-py3-16.04-release

00:05:51

failed #89334
allowed to fail
robotpkg-py-sot-dynamic-pinocchio-v3-py3-18.04-release

00:06:10

failed #89336
robotpkg-py-sot-dynamic-pinocchio-v3-py3-20.04-release

00:07:13

failed #89337
robotpkg-py-sot-dynamic-pinocchio-v3-py3-buster-release

00:03:43

failed #89338
allowed to fail
robotpkg-py-sot-dynamic-pinocchio-v3-py3-stretch-release

00:01:21

passed #89339
robotpkg-sot-dynamic-pinocchio-v3-18.04-release

00:02:21

 
Name Stage Failure
failed
robotpkg-py-sot-dynamic-pinocchio-v3-py3-20.04-release Test
| make[1]: *** [CMakeFiles/Makefile2:1518: src/CMakeFiles/sot-dynamic-pinocchio-zmpreffromcom-wrap.dir/all] Error 2
| make[1]: Leaving directory '/root/robotpkg/wip/py-sot-dynamic-pinocchio-v3/work.runner-5nsakv6-project-198-concurrent-4/sot-dynamic-pinocchio-v3-3.5.2'
| make: *** [Makefile:144: all] Error 2
For details or bug reports, check the complete log file in:
/root/robotpkg/wip/py-sot-dynamic-pinocchio-v3/work.runner-5nsakv6-project-198-concurrent-4/build.log

make: *** [/root/robotpkg/mk/build/build.mk:199: do-build] Error 2
make: *** [/root/robotpkg/mk/internal/trusted.mk:36: install] Error 2
ERROR: Job failed: exit code 1
failed
robotpkg-py-sot-dynamic-pinocchio-v3-py2-18.04-release Test
| Makefile:143: recipe for target 'all' failed

For details or bug reports, check the complete log file in:
/root/robotpkg/wip/py-sot-dynamic-pinocchio-v3/work.runner-5nsakv6-project-198-concurrent-3/build.log
make: *** [do-build] Error 2
/root/robotpkg/mk/build/build.mk:198: recipe for target 'do-build' failed
/root/robotpkg/mk/internal/trusted.mk:36: recipe for target 'install' failed
make: *** [install] Error 2
ERROR: Job failed: exit code 1
failed
robotpkg-py-sot-dynamic-pinocchio-v3-py3-18.04-release Test
| Makefile:143: recipe for target 'all' failed

For details or bug reports, check the complete log file in:
/root/robotpkg/wip/py-sot-dynamic-pinocchio-v3/work.runner-5nsakv6-project-198-concurrent-2/build.log
/root/robotpkg/mk/build/build.mk:198: recipe for target 'do-build' failed
make: *** [do-build] Error 2
make: *** [install] Error 2
/root/robotpkg/mk/internal/trusted.mk:36: recipe for target 'install' failed
ERROR: Job failed: exit code 1
failed
robotpkg-py-sot-dynamic-pinocchio-v3-py3-16.04-release Test
| make: *** [all] Error 2
| Makefile:141: recipe for target 'all' failed
For details or bug reports, check the complete log file in:
/root/robotpkg/wip/py-sot-dynamic-pinocchio-v3/work.runner-5nsakv6-project-198-concurrent-1/build.log
/root/robotpkg/mk/build/build.mk:198: recipe for target 'do-build' failed
make: *** [do-build] Error 2
make: *** [install] Error 2
/root/robotpkg/mk/internal/trusted.mk:36: recipe for target 'install' failed
ERROR: Job failed: exit code 1
failed
robotpkg-py-sot-dynamic-pinocchio-v3-py3-buster-release Test
| make[2]: Leaving directory '/root/robotpkg/wip/sot-dynamic-pinocchio-v3/work.runner-5nsakv6-project-198-concurrent-5/sot-dynamic-pinocchio-v3-3.5.2'
| make[1]: Leaving directory '/root/robotpkg/wip/sot-dynamic-pinocchio-v3/work.runner-5nsakv6-project-198-concurrent-5/sot-dynamic-pinocchio-v3-3.5.2'
For details or bug reports, check the complete log file in:
/root/robotpkg/wip/sot-dynamic-pinocchio-v3/work.runner-5nsakv6-project-198-concurrent-5/build.log

make[1]: *** [/root/robotpkg/mk/build/build.mk:199: do-build] Error 2
make: *** [/root/robotpkg/mk/depends/depends.mk:70: do-depends] Error 1
make: *** [/root/robotpkg/mk/internal/trusted.mk:36: install] Error 2
ERROR: Job failed: exit code 1
failed
doc-coverage Test
src/dynamic.cpp                                3       0     0%   17-18,20
src/sot-dynamic-pinocchio.cpp 475 0 0% 33,35,41-46,50-51,53-54,56-57,61-62,64,66-67,69-70,72,74,76,78,80,82,86,90,94,97-98,100-101,103,105,107,117-137,142,145,152-153,160,166,175,177,179,181,183-184,186,190-191,193,195,197,199,201,203-205,208,211,217,226,228-229,234-235,237-238,240-242,246,250,252,254-255,257-262,265-266,275-277,279-280,283-286,288,292,295,297,299-306,309-310,314-318,320-323,325,329,332,334,336-337,341,344,346,348-349,352,356,358-363,365-372,374-383,385-386,388-389,394,397-403,405-406,410-416,418-419,424,427,429-431,433-436,438,440,442-443,445,448,452,455-457,459-462,464,466-468,470,473,476,478-480,482-485,487,489,491-492,494,497,500-501,505-507,510,513,516-517,520,522-523,526,529,532-534,536-539,543,545,547-548,551,553-555,557-560,564,566,569,571,574,576-578,580-583,587,589,592,594,597,599-601,603-606,610-611,614,617,619,624,627-629,631-636,640,646,648-649,652,654,656-661,664,667,669-671,674,677,680-683,686,689,691,694,697-699,701,705-706,709-713,715,717,719,721-724,727-730,733,735,738,741,744-747,749,754,757,759-762,764,767,769-772,774,777,779-784,791,794,796-797,799,802,804-806,808,810,813,815-817,819,822,825-827,829-830,833,836,840-841,843-844,846,848,851,853-854,856,859,861-862,864,867,870,872,874-875,878,883-884,886-887,893-894,897-898,905-906,908-909,916-917,919-920,935-937,939-940,942,944,947,949,952-953,955-956,958-959 [* 888,890,899,901,910,912,921,923]
src/zmp-from-forces.cpp 2 0 0% 13,15
src/zmp-from-forces.h 46 0 0% 27-28,32-44,47,59-60,64-69,71-72,74-76,78-81,83-89,92-95,97,99
------------------------------------------------------------------------------
TOTAL 566 0 0%
------------------------------------------------------------------------------
$ gcovr -r . --html --html-details -o ${CI_PROJECT_DIR}/coverage/index.html
ERROR: Job failed: exit code 1
failed
robotpkg-py-sot-dynamic-pinocchio-v3-py3-stretch-release Test
/root/robotpkg/wip/sot-dynamic-pinocchio-v3/work.runner-ke6dzkhd-project-198-concurrent-3/configure.log

/root/robotpkg/mk/configure/cmake-configure.mk:100: recipe for target 'do-configure-cmake' failed
make[1]: *** [do-configure-cmake] Error 1
/root/robotpkg/mk/depends/depends.mk:70: recipe for target 'do-depends' failed
make: *** [do-depends] Error 1
/root/robotpkg/mk/internal/trusted.mk:36: recipe for target 'install' failed
make: *** [install] Error 2
ERROR: Job failed: exit code 1
failed
format Test
+++ b/src/zmp-from-forces-python.hh
@@ -1,3 +1,3 @@
#include "zmp-from-forces.h"

-typedef boost::mpl::vector< sot::dynamic::ZmpFromForces > entities_t;
+typedef boost::mpl::vector<sot::dynamic::ZmpFromForces> entities_t;
Running after_script
Uploading artifacts for failed job
ERROR: Job failed: exit code 1