Merge pull request #79 from olivier-stasse/devel

[README.md] Remove link to travis and change it to BSD clause 2 license.
7 jobs for devel in 10 minutes and 53 seconds (queued for 1 second)
Name Stage Failure
failed
format Test
 
M = frame.placement.inverse();

- if (!isLocal) {// Express the jacobian is world coordinate system.
+ if (!isLocal) { // Express the jacobian is world coordinate system.
// Need to compute frame placement for oMf.
pinocchio::updateFramePlacement(*m_model, *m_data, fid);

ERROR: Job failed: exit code 1
failed
robotpkg-py-sot-dynamic-pinocchio-v3-py3-stretch-release Test
For details or bug reports, check the complete log file in:
/root/robotpkg/wip/sot-dynamic-pinocchio-v3/work.runner-swwlejyc-project-198-concurrent-1/configure.log
/root/robotpkg/mk/configure/cmake-configure.mk:100: recipe for target 'do-configure-cmake' failed
make[1]: *** [do-configure-cmake] Error 1
/root/robotpkg/mk/depends/depends.mk:70: recipe for target 'do-depends' failed
make: *** [do-depends] Error 1
make: *** [install] Error 2
/root/robotpkg/mk/internal/trusted.mk:36: recipe for target 'install' failed
ERROR: Job failed: exit code 1