Fix regression in DynamicPinocchio::computeGenericEndeffJacobian

7 jobs for devel in 5 minutes and 20 seconds (queued for 2 seconds)
Status Name Job ID Coverage
  Test
passed doc-coverage #87404

00:05:19

4.0%
failed format #87405
allowed to fail

00:00:17

passed robotpkg-py-sot-dynamic-pinocchio-v3-py2-18.04-release #87400

00:03:51

passed robotpkg-py-sot-dynamic-pinocchio-v3-py3-16.04-release #87399

00:03:16

passed robotpkg-py-sot-dynamic-pinocchio-v3-py3-18.04-release #87401

00:04:40

failed robotpkg-py-sot-dynamic-pinocchio-v3-py3-stretch-release #87402
allowed to fail

00:00:37

passed robotpkg-sot-dynamic-pinocchio-v3-18.04-release #87403

00:01:53

 
Name Stage Failure
failed
robotpkg-py-sot-dynamic-pinocchio-v3-py3-stretch-release Test
For details or bug reports, check the complete log file in:
/root/robotpkg/wip/sot-dynamic-pinocchio-v3/work.runner-5nsakv6-project-198-concurrent-0/configure.log
/root/robotpkg/mk/configure/cmake-configure.mk:100: recipe for target 'do-configure-cmake' failed
make[1]: *** [do-configure-cmake] Error 1
/root/robotpkg/mk/depends/depends.mk:70: recipe for target 'do-depends' failed
make: *** [do-depends] Error 1
make: *** [install] Error 2
/root/robotpkg/mk/internal/trusted.mk:36: recipe for target 'install' failed
ERROR: Job failed: exit code 1
failed
format Test
 
- if (!isLocal) {// Express the jacobian is world coordinate system.
+ if (!isLocal) { // Express the jacobian is world coordinate system.
// Need to compute frame placement for oMf.
pinocchio::updateFramePlacement(*m_model, *m_data, fid);

Running after_script
Uploading artifacts for failed job
ERROR: Job failed: exit code 1