[cmake] Remove useless dependency to Boost_LIBRARIES

Pointed out by G. Saurel and J. Mirabel.
16 jobs for pr/143 in 2 minutes and 44 seconds (queued for 2 seconds)
latest
Status Name Job ID Coverage
  Test
failed doc-coverage #82655

00:00:45

failed format #82656
allowed to fail

00:01:27

failed robotpkg-py-sot-core-v3-16.04-debug #82643

00:00:34

failed robotpkg-py-sot-core-v3-16.04-release #82646

00:00:26

failed robotpkg-py-sot-core-v3-18.04-debug #82658

00:01:36

failed robotpkg-py-sot-core-v3-18.04-release #82648

00:02:43

failed robotpkg-py-sot-core-v3-py3-16.04-debug #82645
allowed to fail

00:00:33

failed robotpkg-py-sot-core-v3-py3-16.04-release #82657
allowed to fail

00:00:25

failed robotpkg-py-sot-core-v3-py3-18.04-debug #82650
allowed to fail

00:00:38

failed robotpkg-py-sot-core-v3-py3-18.04-release #82647
allowed to fail

00:01:03

failed robotpkg-sot-core-v3-16.04-debug #82651

00:00:27

failed robotpkg-sot-core-v3-16.04-release #82652

00:00:42

failed robotpkg-sot-core-v3-18.04-debug #82653

00:00:21

failed robotpkg-sot-core-v3-18.04-release #82654

00:01:02

failed robotpkg-py-sot-core-v3-18.04-debug #82649

00:01:05

failed robotpkg-py-sot-core-v3-py3-16.04-release #82644
allowed to fail

00:01:05

 
Name Stage Failure
failed
robotpkg-py-sot-core-v3-py3-16.04-release Test
make[1]: *** [do-configure-cmake] Error 1
/root/robotpkg/mk/configure/cmake-configure.mk:100: recipe for target 'do-configure-cmake' failed
make: *** [do-depends] Error 1
/root/robotpkg/mk/depends/depends.mk:70: recipe for target 'do-depends' failed
make: *** [install] Error 2
/root/robotpkg/mk/internal/trusted.mk:36: recipe for target 'install' failed
Running after_script
Uploading artifacts for failed job
ERROR: Job failed: exit code 1
failed
robotpkg-py-sot-core-v3-18.04-debug Test
make[1]: *** [do-configure-cmake] Error 1
/root/robotpkg/mk/configure/cmake-configure.mk:100: recipe for target 'do-configure-cmake' failed
/root/robotpkg/mk/depends/depends.mk:70: recipe for target 'do-depends' failed
make: *** [do-depends] Error 1
make: *** [install] Error 2
/root/robotpkg/mk/internal/trusted.mk:36: recipe for target 'install' failed
Running after_script
Uploading artifacts for failed job
ERROR: Job failed: exit code 1
failed
robotpkg-py-sot-core-v3-py3-18.04-debug Test
/root/robotpkg/mk/configure/cmake-configure.mk:100: recipe for target 'do-configure-cmake' failed
make[1]: *** [do-configure-cmake] Error 1
make: *** [do-depends] Error 1
/root/robotpkg/mk/depends/depends.mk:70: recipe for target 'do-depends' failed
/root/robotpkg/mk/internal/trusted.mk:36: recipe for target 'install' failed
make: *** [install] Error 2
Running after_script
Uploading artifacts for failed job
ERROR: Job failed: exit code 1
failed
robotpkg-sot-core-v3-18.04-release Test
For details or bug reports, check the complete log file in:
/root/robotpkg/wip/sot-core-v3/work.runner-sj6l9vby-project-65-concurrent-1/configure.log
make: *** [do-configure-cmake] Error 1
/root/robotpkg/mk/configure/cmake-configure.mk:100: recipe for target 'do-configure-cmake' failed
make: *** [install] Error 2
/root/robotpkg/mk/internal/trusted.mk:36: recipe for target 'install' failed
Running after_script
Uploading artifacts for failed job
ERROR: Job failed: exit code 1
failed
robotpkg-py-sot-core-v3-py3-18.04-release Test
/root/robotpkg/mk/configure/cmake-configure.mk:100: recipe for target 'do-configure-cmake' failed
make[1]: *** [do-configure-cmake] Error 1
/root/robotpkg/mk/depends/depends.mk:70: recipe for target 'do-depends' failed
make: *** [do-depends] Error 1
make: *** [install] Error 2
/root/robotpkg/mk/internal/trusted.mk:36: recipe for target 'install' failed
Running after_script
Uploading artifacts for failed job
ERROR: Job failed: exit code 1
failed
robotpkg-py-sot-core-v3-16.04-debug Test
/root/robotpkg/mk/configure/cmake-configure.mk:100: recipe for target 'do-configure-cmake' failed
make[1]: *** [do-configure-cmake] Error 1
/root/robotpkg/mk/depends/depends.mk:70: recipe for target 'do-depends' failed
make: *** [do-depends] Error 1
/root/robotpkg/mk/internal/trusted.mk:36: recipe for target 'install' failed
make: *** [install] Error 2
Running after_script
Uploading artifacts for failed job
ERROR: Job failed: exit code 1
failed
robotpkg-sot-core-v3-18.04-debug Test
For details or bug reports, check the complete log file in:
/root/robotpkg/wip/sot-core-v3/work.runner-ke6dzkhd-project-65-concurrent-1/configure.log
/root/robotpkg/mk/configure/cmake-configure.mk:100: recipe for target 'do-configure-cmake' failed
make: *** [do-configure-cmake] Error 1
/root/robotpkg/mk/internal/trusted.mk:36: recipe for target 'install' failed
make: *** [install] Error 2
Running after_script
Uploading artifacts for failed job
ERROR: Job failed: exit code 1
failed
robotpkg-py-sot-core-v3-py3-16.04-debug Test
/root/robotpkg/mk/configure/cmake-configure.mk:100: recipe for target 'do-configure-cmake' failed
make[1]: *** [do-configure-cmake] Error 1
/root/robotpkg/mk/depends/depends.mk:70: recipe for target 'do-depends' failed
make: *** [do-depends] Error 1
/root/robotpkg/mk/internal/trusted.mk:36: recipe for target 'install' failed
make: *** [install] Error 2
Running after_script
Uploading artifacts for failed job
ERROR: Job failed: exit code 1
failed
robotpkg-py-sot-core-v3-16.04-release Test
/root/robotpkg/mk/configure/cmake-configure.mk:100: recipe for target 'do-configure-cmake' failed
make[1]: *** [do-configure-cmake] Error 1
make: *** [do-depends] Error 1
/root/robotpkg/mk/depends/depends.mk:70: recipe for target 'do-depends' failed
/root/robotpkg/mk/internal/trusted.mk:36: recipe for target 'install' failed
make: *** [install] Error 2
Running after_script
Uploading artifacts for failed job
ERROR: Job failed: exit code 1
failed
format Test
+      DYNAMIC_GRAPH_ENTITY_ERROR_STREAM(*this)
+ << "Projector of " << getName() << " has " << K.rows()
+ << " rows while " << nbJoints << " expected.\n";
}
}
for (StackType::iterator iter = stack.begin(); iter != stack.end(); ++iter) {
Running after_script
Uploading artifacts for failed job
ERROR: Job failed: exit code 1
failed
doc-coverage Test
Running after script...
$ cd /root/robotpkg/wip/py-sot-core-v3
$ build=$(make show-var VARNAME=CONFIGURE_DIRS); cd $(make show-var VARNAME=WRKSRC); cd $build
$ make doc
make: Nothing to be done for 'doc'.
$ mv doc/doxygen-html ${CI_PROJECT_DIR}
mv: cannot stat 'doc/doxygen-html': No such file or directory
Uploading artifacts for failed job
ERROR: Job failed: exit code 1
failed
robotpkg-py-sot-core-v3-18.04-release Test
make[1]: *** [do-configure-cmake] Error 1
/root/robotpkg/mk/configure/cmake-configure.mk:100: recipe for target 'do-configure-cmake' failed
make: *** [do-depends] Error 1
/root/robotpkg/mk/depends/depends.mk:70: recipe for target 'do-depends' failed
/root/robotpkg/mk/internal/trusted.mk:36: recipe for target 'install' failed
make: *** [install] Error 2
Running after_script
Uploading artifacts for failed job
ERROR: Job failed: exit code 1
failed
robotpkg-sot-core-v3-16.04-release Test
For details or bug reports, check the complete log file in:
/root/robotpkg/wip/sot-core-v3/work.runner-xmw7yeme-project-65-concurrent-0/configure.log
/root/robotpkg/mk/configure/cmake-configure.mk:100: recipe for target 'do-configure-cmake' failed
make: *** [do-configure-cmake] Error 1
/root/robotpkg/mk/internal/trusted.mk:36: recipe for target 'install' failed
make: *** [install] Error 2
Running after_script
Uploading artifacts for failed job
ERROR: Job failed: exit code 1
failed
robotpkg-sot-core-v3-16.04-debug Test
For details or bug reports, check the complete log file in:
/root/robotpkg/wip/sot-core-v3/work.runner-qtz7nxce-project-65-concurrent-2/configure.log
/root/robotpkg/mk/configure/cmake-configure.mk:100: recipe for target 'do-configure-cmake' failed
make: *** [do-configure-cmake] Error 1
/root/robotpkg/mk/internal/trusted.mk:36: recipe for target 'install' failed
make: *** [install] Error 2
Running after_script
Uploading artifacts for failed job
ERROR: Job failed: exit code 1