provide useless import for compatibility

20 jobs for master in 25 minutes and 17 seconds (queued for 2 seconds)
Status Name Job ID Coverage
  Test
failed doc-coverage #67502

00:24:59

failed format #67503
allowed to fail

00:04:06

failed robotpkg-py-sot-core-v3-16.04-debug #67487
allowed to fail

00:19:07

failed robotpkg-py-sot-core-v3-16.04-release #67484
allowed to fail

00:19:09

failed robotpkg-py-sot-core-v3-18.04-debug #67490
allowed to fail

00:12:31

failed robotpkg-py-sot-core-v3-18.04-release #67489
allowed to fail

00:25:02

failed robotpkg-py-sot-core-v3-py3-16.04-debug #67485
allowed to fail

00:19:08

failed robotpkg-py-sot-core-v3-py3-16.04-release #67486
allowed to fail

00:19:08

failed robotpkg-py-sot-core-v3-py3-18.04-debug #67491
allowed to fail

00:24:52

failed robotpkg-py-sot-core-v3-py3-18.04-release #67488
allowed to fail

00:25:01

failed robotpkg-py-sot-core-v3-py3-stretch-debug #67495
allowed to fail

00:25:00

failed robotpkg-py-sot-core-v3-py3-stretch-release #67492
allowed to fail

00:12:28

failed robotpkg-py-sot-core-v3-stretch-debug #67493
allowed to fail

00:24:52

failed robotpkg-py-sot-core-v3-stretch-release #67494
allowed to fail

00:12:29

passed robotpkg-sot-core-v3-16.04-debug #67496

00:09:19

passed robotpkg-sot-core-v3-16.04-release #67497

00:19:14

passed robotpkg-sot-core-v3-18.04-debug #67498

00:25:09

passed robotpkg-sot-core-v3-18.04-release #67499

00:25:08

passed robotpkg-sot-core-v3-stretch-debug #67501

00:25:08

passed robotpkg-sot-core-v3-stretch-release #67500

00:25:14

 
Name Stage Failure
failed
robotpkg-py-sot-core-v3-18.04-release Test
ERROR: missing:	/opt/openrobots/lib/cmake/sot-core/sot-coreConfigVersion.cmake
ERROR:
ERROR: Please reinstall the package in ../../wip/sot-core-v3
ERROR: ======================================================================
make: *** [do-depends] Error 1
/root/robotpkg/mk/depends/depends.mk:70: recipe for target 'do-depends' failed
/root/robotpkg/mk/internal/trusted.mk:36: recipe for target 'install' failed
make: *** [install] Error 2
ERROR: Job failed: exit code 1
failed
robotpkg-py-sot-core-v3-py3-stretch-debug Test
ERROR: missing:	/opt/openrobots/lib/cmake/sot-core/sot-coreConfigVersion.cmake
ERROR:
ERROR: Please reinstall the package in ../../wip/sot-core-v3
ERROR: ======================================================================
make: *** [do-depends] Error 1
/root/robotpkg/mk/depends/depends.mk:70: recipe for target 'do-depends' failed
make: *** [install] Error 2
/root/robotpkg/mk/internal/trusted.mk:36: recipe for target 'install' failed
ERROR: Job failed: exit code 1
failed
robotpkg-py-sot-core-v3-py3-16.04-debug Test
ERROR: missing:	/opt/openrobots/lib/cmake/sot-core/sot-coreConfigVersion.cmake
ERROR:
ERROR: Please reinstall the package in ../../wip/sot-core-v3
ERROR: ======================================================================
make: *** [do-depends] Error 1
/root/robotpkg/mk/depends/depends.mk:70: recipe for target 'do-depends' failed
/root/robotpkg/mk/internal/trusted.mk:36: recipe for target 'install' failed
make: *** [install] Error 2
ERROR: Job failed: exit code 1
failed
doc-coverage Test
/root/robotpkg/mk/internal/trusted.mk:36: recipe for target 'install' failed
Running after script...
$ cd /root/robotpkg/wip/py-sot-core-v3
$ build=$(make show-var VARNAME=CONFIGURE_DIRS); cd $(make show-var VARNAME=WRKSRC); cd $build
$ make doc
make: Nothing to be done for 'doc'.
$ mv doc/doxygen-html ${CI_PROJECT_DIR}
mv: cannot stat 'doc/doxygen-html': No such file or directory
ERROR: Job failed: exit code 1
failed
robotpkg-py-sot-core-v3-py3-18.04-release Test
ERROR: missing:	/opt/openrobots/lib/cmake/sot-core/sot-coreConfigVersion.cmake
ERROR:
ERROR: Please reinstall the package in ../../wip/sot-core-v3
ERROR: ======================================================================
/root/robotpkg/mk/depends/depends.mk:70: recipe for target 'do-depends' failed
make: *** [do-depends] Error 1
make: *** [install] Error 2
/root/robotpkg/mk/internal/trusted.mk:36: recipe for target 'install' failed
ERROR: Job failed: exit code 1
failed
robotpkg-py-sot-core-v3-stretch-debug Test
ERROR: missing:	/opt/openrobots/lib/cmake/sot-core/sot-coreConfigVersion.cmake
ERROR:
ERROR: Please reinstall the package in ../../wip/sot-core-v3
ERROR: ======================================================================
make: *** [do-depends] Error 1
/root/robotpkg/mk/depends/depends.mk:70: recipe for target 'do-depends' failed
/root/robotpkg/mk/internal/trusted.mk:36: recipe for target 'install' failed
make: *** [install] Error 2
ERROR: Job failed: exit code 1
failed
robotpkg-py-sot-core-v3-py3-18.04-debug Test
ERROR: missing:	/opt/openrobots/lib/cmake/sot-core/sot-coreConfigVersion.cmake
ERROR:
ERROR: Please reinstall the package in ../../wip/sot-core-v3
ERROR: ======================================================================
make: *** [do-depends] Error 1
/root/robotpkg/mk/depends/depends.mk:70: recipe for target 'do-depends' failed
/root/robotpkg/mk/internal/trusted.mk:36: recipe for target 'install' failed
make: *** [install] Error 2
ERROR: Job failed: exit code 1
failed
robotpkg-py-sot-core-v3-py3-16.04-release Test
ERROR: missing:	/opt/openrobots/lib/cmake/sot-core/sot-coreConfigVersion.cmake
ERROR:
ERROR: Please reinstall the package in ../../wip/sot-core-v3
ERROR: ======================================================================
make: *** [do-depends] Error 1
/root/robotpkg/mk/depends/depends.mk:70: recipe for target 'do-depends' failed
/root/robotpkg/mk/internal/trusted.mk:36: recipe for target 'install' failed
make: *** [install] Error 2
ERROR: Job failed: exit code 1
failed
robotpkg-py-sot-core-v3-16.04-release Test
ERROR: missing:	/opt/openrobots/lib/cmake/sot-core/sot-coreConfigVersion.cmake
ERROR:
ERROR: Please reinstall the package in ../../wip/sot-core-v3
ERROR: ======================================================================
make: *** [do-depends] Error 1
/root/robotpkg/mk/depends/depends.mk:70: recipe for target 'do-depends' failed
/root/robotpkg/mk/internal/trusted.mk:36: recipe for target 'install' failed
make: *** [install] Error 2
ERROR: Job failed: exit code 1
failed
robotpkg-py-sot-core-v3-16.04-debug Test
ERROR: missing:	/opt/openrobots/lib/cmake/sot-core/sot-coreConfigVersion.cmake
ERROR:
ERROR: Please reinstall the package in ../../wip/sot-core-v3
ERROR: ======================================================================
/root/robotpkg/mk/depends/depends.mk:70: recipe for target 'do-depends' failed
make: *** [do-depends] Error 1
/root/robotpkg/mk/internal/trusted.mk:36: recipe for target 'install' failed
make: *** [install] Error 2
ERROR: Job failed: exit code 1
failed
robotpkg-py-sot-core-v3-18.04-debug Test
ERROR: missing:	/opt/openrobots/lib/cmake/sot-core/sot-coreConfigVersion.cmake
ERROR:
ERROR: Please reinstall the package in ../../wip/sot-core-v3
ERROR: ======================================================================
make: *** [do-depends] Error 1
/root/robotpkg/mk/depends/depends.mk:70: recipe for target 'do-depends' failed
/root/robotpkg/mk/internal/trusted.mk:36: recipe for target 'install' failed
make: *** [install] Error 2
ERROR: Job failed: exit code 1
failed
robotpkg-py-sot-core-v3-stretch-release Test
ERROR: missing:	/opt/openrobots/lib/cmake/sot-core/sot-coreConfigVersion.cmake
ERROR:
ERROR: Please reinstall the package in ../../wip/sot-core-v3
ERROR: ======================================================================
/root/robotpkg/mk/depends/depends.mk:70: recipe for target 'do-depends' failed
make: *** [do-depends] Error 1
make: *** [install] Error 2
/root/robotpkg/mk/internal/trusted.mk:36: recipe for target 'install' failed
ERROR: Job failed: exit code 1
failed
robotpkg-py-sot-core-v3-py3-stretch-release Test
ERROR: missing:	/opt/openrobots/lib/cmake/sot-core/sot-coreConfigVersion.cmake
ERROR:
ERROR: Please reinstall the package in ../../wip/sot-core-v3
ERROR: ======================================================================
/root/robotpkg/mk/depends/depends.mk:70: recipe for target 'do-depends' failed
make: *** [do-depends] Error 1
/root/robotpkg/mk/internal/trusted.mk:36: recipe for target 'install' failed
make: *** [install] Error 2
ERROR: Job failed: exit code 1
failed
format Test
     jb_ = model_.getJointId("rarm_wrist2_joint");
fb_ = model_.addFrame(pinocchio::Model::Frame(
- "frame_b", jb_, model_.getFrameId("rarm_wrist2_joint", pinocchio::JOINT),
+ "frame_b", jb_,
+ model_.getFrameId("rarm_wrist2_joint", pinocchio::JOINT),
SE3::Identity(), pinocchio::OP_FRAME));
if (relative) {
ja_ = model_.getJointId("larm_wrist2_joint");
ERROR: Job failed: exit code 1