[cmake] Synchronize jrl-cmakemodules

60 jobs for v4.6.0 in 37 minutes and 31 seconds (queued for 61 minutes and 40 seconds)
latest
Status Name Job ID Coverage
  Test
failed doc-coverage #54296

00:29:52

61.0%
failed format #54297
allowed to fail

00:02:06

failed robotpkg-py-sot-core-v3-16.04-debug #54281

00:27:08

failed robotpkg-py-sot-core-v3-16.04-release #54278

00:15:13

failed robotpkg-py-sot-core-v3-18.04-debug #54284

00:20:27

failed robotpkg-py-sot-core-v3-18.04-release #54283

00:25:09

failed robotpkg-py-sot-core-v3-py3-16.04-debug #54279
allowed to fail

00:08:28

failed robotpkg-py-sot-core-v3-py3-16.04-release #54280
allowed to fail

00:08:34

failed robotpkg-py-sot-core-v3-py3-18.04-debug #54285
allowed to fail

00:20:05

failed robotpkg-py-sot-core-v3-py3-18.04-release #54282
allowed to fail

00:08:21

failed robotpkg-py-sot-core-v3-py3-stretch-debug #54289

00:15:56

failed robotpkg-py-sot-core-v3-py3-stretch-release #54286

00:15:57

failed robotpkg-py-sot-core-v3-stretch-debug #54287

00:16:38

failed robotpkg-py-sot-core-v3-stretch-release #54288

00:37:29

failed robotpkg-sot-core-v3-16.04-debug #54290

00:14:19

failed robotpkg-sot-core-v3-16.04-release #54291

00:05:56

failed robotpkg-sot-core-v3-18.04-debug #54292

00:15:18

failed robotpkg-sot-core-v3-18.04-release #54293

00:15:44

failed robotpkg-sot-core-v3-stretch-debug #54295

00:16:03

failed robotpkg-sot-core-v3-stretch-release #54294

00:20:04

failed doc-coverage #54207

00:59:19

61.0%
failed doc-coverage #53547

00:30:19

61.0%
failed format #54208
allowed to fail

00:10:54

failed format #53548
allowed to fail

00:01:35

failed robotpkg-py-sot-core-v3-16.04-debug #54192

00:10:18

failed robotpkg-py-sot-core-v3-16.04-debug #53532

00:10:18

failed robotpkg-py-sot-core-v3-16.04-release #54189

00:44:23

failed robotpkg-py-sot-core-v3-16.04-release #53529

00:16:07

failed robotpkg-py-sot-core-v3-18.04-debug #54195

00:10:19

failed robotpkg-py-sot-core-v3-18.04-debug #53535

00:06:50

failed robotpkg-py-sot-core-v3-18.04-release #54194

00:09:56

failed robotpkg-py-sot-core-v3-18.04-release #53534

00:06:15

failed robotpkg-py-sot-core-v3-py3-16.04-debug #54190
allowed to fail

00:34:59

failed robotpkg-py-sot-core-v3-py3-16.04-debug #53530
allowed to fail

00:23:06

failed robotpkg-py-sot-core-v3-py3-16.04-release #54191
allowed to fail

00:26:19

failed robotpkg-py-sot-core-v3-py3-16.04-release #53531
allowed to fail

00:10:22

failed robotpkg-py-sot-core-v3-py3-18.04-debug #54196
allowed to fail

00:36:48

failed robotpkg-py-sot-core-v3-py3-18.04-debug #53536
allowed to fail

00:07:05

failed robotpkg-py-sot-core-v3-py3-18.04-release #54193
allowed to fail

00:36:52

failed robotpkg-py-sot-core-v3-py3-18.04-release #53533
allowed to fail

00:06:18

failed robotpkg-py-sot-core-v3-py3-stretch-debug #54200

00:43:38

failed robotpkg-py-sot-core-v3-py3-stretch-debug #53540

00:26:51

failed robotpkg-py-sot-core-v3-py3-stretch-release #54197

00:37:02

failed robotpkg-py-sot-core-v3-py3-stretch-release #53537

00:08:45

failed robotpkg-py-sot-core-v3-stretch-debug #54198

00:10:17

failed robotpkg-py-sot-core-v3-stretch-debug #53538

00:38:40

failed robotpkg-py-sot-core-v3-stretch-release #54199

00:52:01

failed robotpkg-py-sot-core-v3-stretch-release #53539

00:38:03

failed robotpkg-sot-core-v3-16.04-debug #54201

00:10:17

failed robotpkg-sot-core-v3-16.04-debug #53541

00:06:02

failed robotpkg-sot-core-v3-16.04-release #54202

00:34:57

failed robotpkg-sot-core-v3-16.04-release #53542

00:05:59

failed robotpkg-sot-core-v3-18.04-debug #54203

00:43:19

failed robotpkg-sot-core-v3-18.04-debug #53543

00:31:07

failed robotpkg-sot-core-v3-18.04-release #54204

00:43:39

failed robotpkg-sot-core-v3-18.04-release #53544

00:10:46

failed robotpkg-sot-core-v3-stretch-debug #54206

00:43:37

failed robotpkg-sot-core-v3-stretch-debug #53546

00:25:04

failed robotpkg-sot-core-v3-stretch-release #54205

00:43:44

failed robotpkg-sot-core-v3-stretch-release #53545

00:10:47

 
Name Stage Failure
failed
robotpkg-py-sot-core-v3-18.04-debug Test

Total Test time (real) = 9.93 sec

The following tests FAILED:
4 - features/test_feature_generic (Failed)
Errors while running CTest
make: *** [test] Error 8
Makefile:98: recipe for target 'test' failed
ERROR: Job failed: exit code 1
failed
robotpkg-py-sot-core-v3-py3-18.04-release Test
| See also "/root/robotpkg/wip/py-sot-core-v3/work.runner-sWwLEjyc-project-65-concurrent-1/sot-core-4.7.1/CMakeFiles/CMakeOutput.log".

For details or bug reports, check the complete log file in:
/root/robotpkg/wip/py-sot-core-v3/work.runner-sWwLEjyc-project-65-concurrent-1/configure.log
make: *** [do-configure-cmake] Error 1
/root/robotpkg/mk/configure/cmake-configure.mk:100: recipe for target 'do-configure-cmake' failed
/root/robotpkg/mk/internal/trusted.mk:36: recipe for target 'install' failed
make: *** [install] Error 2
ERROR: Job failed: exit code 1
failed
robotpkg-py-sot-core-v3-py3-16.04-release Test
| See also "/root/robotpkg/wip/py-sot-core-v3/work.runner-ULfN9w-c-project-65-concurrent-4/sot-core-4.7.1/CMakeFiles/CMakeOutput.log".
For details or bug reports, check the complete log file in:
/root/robotpkg/wip/py-sot-core-v3/work.runner-ULfN9w-c-project-65-concurrent-4/configure.log

make: *** [do-configure-cmake] Error 1
/root/robotpkg/mk/configure/cmake-configure.mk:100: recipe for target 'do-configure-cmake' failed
make: *** [install] Error 2
/root/robotpkg/mk/internal/trusted.mk:36: recipe for target 'install' failed
ERROR: Job failed: exit code 1
failed
robotpkg-py-sot-core-v3-16.04-debug Test

Total Test time (real) = 14.84 sec

The following tests FAILED:
4 - features/test_feature_generic (Failed)
Errors while running CTest
Makefile:85: recipe for target 'test' failed
make: *** [test] Error 8
ERROR: Job failed: exit code 1
failed
robotpkg-py-sot-core-v3-py3-stretch-release Test
| See also "/root/robotpkg/wip/py-sot-core-v3/work.runner-tRjAffv3-project-65-concurrent-2/sot-core-4.7.1/CMakeFiles/CMakeOutput.log".

For details or bug reports, check the complete log file in:
/root/robotpkg/wip/py-sot-core-v3/work.runner-tRjAffv3-project-65-concurrent-2/configure.log
/root/robotpkg/mk/configure/cmake-configure.mk:100: recipe for target 'do-configure-cmake' failed
make: *** [do-configure-cmake] Error 1
/root/robotpkg/mk/internal/trusted.mk:36: recipe for target 'install' failed
make: *** [install] Error 2
ERROR: Job failed: exit code 1
failed
robotpkg-py-sot-core-v3-stretch-debug Test

Total Test time (real) = 8.82 sec

The following tests FAILED:
4 - features/test_feature_generic (Failed)
Errors while running CTest
Makefile:85: recipe for target 'test' failed
make: *** [test] Error 8
ERROR: Job failed: exit code 1
failed
robotpkg-sot-core-v3-16.04-debug Test

Total Test time (real) = 15.27 sec

The following tests FAILED:
4 - features/test_feature_generic (Failed)
Errors while running CTest
make: *** [test] Error 8
Makefile:85: recipe for target 'test' failed
ERROR: Job failed: exit code 1
failed
robotpkg-py-sot-core-v3-py3-16.04-debug Test
| 

For details or bug reports, check the complete log file in:
/root/robotpkg/wip/py-sot-core-v3/work.runner-ULfN9w-c-project-65-concurrent-3/configure.log
/root/robotpkg/mk/configure/cmake-configure.mk:100: recipe for target 'do-configure-cmake' failed
make: *** [do-configure-cmake] Error 1
/root/robotpkg/mk/internal/trusted.mk:36: recipe for target 'install' failed
make: *** [install] Error 2
ERROR: Job failed: exit code 1
failed
robotpkg-py-sot-core-v3-16.04-release Test

Total Test time (real) = 0.32 sec

The following tests FAILED:
4 - features/test_feature_generic (Failed)
Errors while running CTest
make: *** [test] Error 8
Makefile:85: recipe for target 'test' failed
ERROR: Job failed: exit code 1
failed
robotpkg-py-sot-core-v3-stretch-release Test

Total Test time (real) = 1.07 sec

The following tests FAILED:
4 - features/test_feature_generic (Failed)
Errors while running CTest
make: *** [test] Error 8
Makefile:85: recipe for target 'test' failed
ERROR: Job failed: exit code 1
failed
robotpkg-sot-core-v3-16.04-release Test

Total Test time (real) = 0.25 sec

The following tests FAILED:
Errors while running CTest
4 - features/test_feature_generic (Failed)
Makefile:85: recipe for target 'test' failed
make: *** [test] Error 8
ERROR: Job failed: exit code 1
failed
robotpkg-sot-core-v3-18.04-release Test

Total Test time (real) = 0.59 sec

The following tests FAILED:
4 - features/test_feature_generic (Failed)
Errors while running CTest
make: *** [test] Error 8
Makefile:109: recipe for target 'test' failed
ERROR: Job failed: exit code 1
failed
robotpkg-sot-core-v3-stretch-debug Test

Total Test time (real) = 10.92 sec

The following tests FAILED:
4 - features/test_feature_generic (Failed)
Errors while running CTest
Makefile:74: recipe for target 'test' failed
make: *** [test] Error 8
ERROR: Job failed: exit code 1
failed
robotpkg-sot-core-v3-stretch-release Test

Total Test time (real) = 0.93 sec

The following tests FAILED:
4 - features/test_feature_generic (Failed)
Errors while running CTest
Makefile:74: recipe for target 'test' failed
make: *** [test] Error 8
ERROR: Job failed: exit code 1
failed
robotpkg-py-sot-core-v3-py3-18.04-debug Test
| See also "/root/robotpkg/wip/py-sot-core-v3/work.runner-7gqkM7SY-project-65-concurrent-3/sot-core-4.7.1/CMakeFiles/CMakeOutput.log".

For details or bug reports, check the complete log file in:
/root/robotpkg/wip/py-sot-core-v3/work.runner-7gqkM7SY-project-65-concurrent-3/configure.log
/root/robotpkg/mk/configure/cmake-configure.mk:100: recipe for target 'do-configure-cmake' failed
make: *** [do-configure-cmake] Error 1
/root/robotpkg/mk/internal/trusted.mk:36: recipe for target 'install' failed
make: *** [install] Error 2
ERROR: Job failed: exit code 1
failed
robotpkg-py-sot-core-v3-18.04-release Test

Total Test time (real) = 0.37 sec

The following tests FAILED:
4 - features/test_feature_generic (Failed)
Errors while running CTest
make: *** [test] Error 8
Makefile:98: recipe for target 'test' failed
ERROR: Job failed: exit code 1
failed
robotpkg-py-sot-core-v3-py3-stretch-debug Test
| See also "/root/robotpkg/wip/py-sot-core-v3/work.runner-tRjAffv3-project-65-concurrent-3/sot-core-4.7.1/CMakeFiles/CMakeOutput.log".

For details or bug reports, check the complete log file in:
/root/robotpkg/wip/py-sot-core-v3/work.runner-tRjAffv3-project-65-concurrent-3/configure.log
/root/robotpkg/mk/configure/cmake-configure.mk:100: recipe for target 'do-configure-cmake' failed
make: *** [do-configure-cmake] Error 1
make: *** [install] Error 2
/root/robotpkg/mk/internal/trusted.mk:36: recipe for target 'install' failed
ERROR: Job failed: exit code 1
failed
doc-coverage Test
unitTesting/tools/test_matrix.cpp             20      20   100%   
unitTesting/tools/test_robot_utils.cpp 93 82 88% 36,44-45,60,77,94,147-148,159-160,170
unitTesting/traces/files.cpp 9 8 88% 26
unitTesting/traces/test_traces.cpp 16 16 100%
------------------------------------------------------------------------------
TOTAL 3100 1903 61%
------------------------------------------------------------------------------
$ gcovr -r . --html --html-details -o ${CI_PROJECT_DIR}/coverage/index.html
ERROR: Job failed: exit code 1
failed
robotpkg-sot-core-v3-18.04-debug Test

Total Test time (real) = 12.59 sec

The following tests FAILED:
4 - features/test_feature_generic (Failed)
Errors while running CTest
Makefile:109: recipe for target 'test' failed
make: *** [test] Error 8
ERROR: Job failed: exit code 1
failed
format Test
+  tracer->addSignalToTrace(sig1);
+ tracer->openFiles("/tmp/sot-core", "tr_", ".dat");

- tracer->addSignalToTrace( sig2 );
+ tracer->addSignalToTrace(sig2);

return 0;
}
ERROR: Job failed: exit code 1