[unitTest] Add python unit test.

20 jobs for v4.5.0 in 44 minutes and 44 seconds (queued for 53 minutes and 52 seconds)
latest
Status Name Job ID Coverage
  Test
failed doc-coverage #53527

00:32:54

failed format #53528
allowed to fail

00:01:51

failed robotpkg-py-sot-core-v3-16.04-debug #53512

00:35:15

failed robotpkg-py-sot-core-v3-16.04-release #53509

00:10:43

failed robotpkg-py-sot-core-v3-18.04-debug #53515

00:14:43

failed robotpkg-py-sot-core-v3-18.04-release #53514

00:20:28

failed robotpkg-py-sot-core-v3-py3-16.04-debug #53510
allowed to fail

00:07:24

failed robotpkg-py-sot-core-v3-py3-16.04-release #53511
allowed to fail

00:07:20

failed robotpkg-py-sot-core-v3-py3-18.04-debug #53516
allowed to fail

00:07:36

failed robotpkg-py-sot-core-v3-py3-18.04-release #53513
allowed to fail

00:07:32

failed robotpkg-py-sot-core-v3-py3-stretch-debug #53520

00:31:52

failed robotpkg-py-sot-core-v3-py3-stretch-release #53517

00:30:56

failed robotpkg-py-sot-core-v3-stretch-debug #53518

00:19:22

failed robotpkg-py-sot-core-v3-stretch-release #53519

00:38:52

passed robotpkg-sot-core-v3-16.04-debug #53521

00:24:49

passed robotpkg-sot-core-v3-16.04-release #53522

00:26:24

passed robotpkg-sot-core-v3-18.04-debug #53523

00:09:54

passed robotpkg-sot-core-v3-18.04-release #53524

00:30:41

passed robotpkg-sot-core-v3-stretch-debug #53526

00:29:31

passed robotpkg-sot-core-v3-stretch-release #53525

00:30:31

 
Name Stage Failure
failed
doc-coverage Test
CMakeFiles/Makefile2:1318: recipe for target 'CMakeFiles/doc.dir/all' failed
make[2]: *** [CMakeFiles/doc.dir/all] Error 2
make[2]: Leaving directory '/root/robotpkg/wip/py-sot-core-v3/work.runner-tRjAffv3-project-65-concurrent-11/sot-core-4.7.1'
make[1]: *** [CMakeFiles/doc.dir/rule] Error 2
CMakeFiles/Makefile2:1325: recipe for target 'CMakeFiles/doc.dir/rule' failed
make[1]: Leaving directory '/root/robotpkg/wip/py-sot-core-v3/work.runner-tRjAffv3-project-65-concurrent-11/sot-core-4.7.1'
Makefile:683: recipe for target 'doc' failed
make: *** [doc] Error 2
ERROR: Job failed: exit code 1
failed
robotpkg-py-sot-core-v3-18.04-debug Test

Total Test time (real) = 8.93 sec

The following tests FAILED:
24 - py-op-point-modifier (Failed)
Errors while running CTest
make: *** [test] Error 8
Makefile:98: recipe for target 'test' failed
ERROR: Job failed: exit code 1
failed
robotpkg-py-sot-core-v3-py3-16.04-debug Test
| See also "/root/robotpkg/wip/py-sot-core-v3/work.runner-ULfN9w-c-project-65-concurrent-3/sot-core-4.7.1/CMakeFiles/CMakeOutput.log".
For details or bug reports, check the complete log file in:
/root/robotpkg/wip/py-sot-core-v3/work.runner-ULfN9w-c-project-65-concurrent-3/configure.log
make: *** [do-configure-cmake] Error 1

/root/robotpkg/mk/configure/cmake-configure.mk:100: recipe for target 'do-configure-cmake' failed
/root/robotpkg/mk/internal/trusted.mk:36: recipe for target 'install' failed
make: *** [install] Error 2
ERROR: Job failed: exit code 1
failed
robotpkg-py-sot-core-v3-stretch-release Test

Total Test time (real) = 1.85 sec

The following tests FAILED:
24 - py-op-point-modifier (Failed)
Errors while running CTest
Makefile:85: recipe for target 'test' failed
make: *** [test] Error 8
ERROR: Job failed: exit code 1
failed
robotpkg-py-sot-core-v3-py3-stretch-release Test
| See also "/root/robotpkg/wip/py-sot-core-v3/work.runner-7gqkM7SY-project-65-concurrent-28/sot-core-4.7.1/CMakeFiles/CMakeOutput.log".
For details or bug reports, check the complete log file in:
/root/robotpkg/wip/py-sot-core-v3/work.runner-7gqkM7SY-project-65-concurrent-28/configure.log

/root/robotpkg/mk/configure/cmake-configure.mk:100: recipe for target 'do-configure-cmake' failed
make: *** [do-configure-cmake] Error 1
/root/robotpkg/mk/internal/trusted.mk:36: recipe for target 'install' failed
make: *** [install] Error 2
ERROR: Job failed: exit code 1
failed
robotpkg-py-sot-core-v3-stretch-debug Test

Total Test time (real) = 9.05 sec

The following tests FAILED:
24 - py-op-point-modifier (Failed)
Errors while running CTest
Makefile:85: recipe for target 'test' failed
make: *** [test] Error 8
ERROR: Job failed: exit code 1
failed
robotpkg-py-sot-core-v3-py3-18.04-debug Test
| See also "/root/robotpkg/wip/py-sot-core-v3/work.runner-sWwLEjyc-project-65-concurrent-3/sot-core-4.7.1/CMakeFiles/CMakeOutput.log".

For details or bug reports, check the complete log file in:
/root/robotpkg/wip/py-sot-core-v3/work.runner-sWwLEjyc-project-65-concurrent-3/configure.log
/root/robotpkg/mk/configure/cmake-configure.mk:100: recipe for target 'do-configure-cmake' failed
make: *** [do-configure-cmake] Error 1
make: *** [install] Error 2
/root/robotpkg/mk/internal/trusted.mk:36: recipe for target 'install' failed
ERROR: Job failed: exit code 1
failed
robotpkg-py-sot-core-v3-16.04-release Test

Total Test time (real) = 0.36 sec

The following tests FAILED:
24 - py-op-point-modifier (Failed)
Errors while running CTest
Makefile:85: recipe for target 'test' failed
make: *** [test] Error 8
ERROR: Job failed: exit code 1
failed
format Test
+  tracer->addSignalToTrace(sig1);
+ tracer->openFiles("/tmp/sot-core", "tr_", ".dat");

- tracer->addSignalToTrace( sig2 );
+ tracer->addSignalToTrace(sig2);

return 0;
}
ERROR: Job failed: exit code 1
failed
robotpkg-py-sot-core-v3-16.04-debug Test

Total Test time (real) = 16.42 sec

The following tests FAILED:
24 - py-op-point-modifier (Failed)
Errors while running CTest
Makefile:85: recipe for target 'test' failed
make: *** [test] Error 8
ERROR: Job failed: exit code 1
failed
robotpkg-py-sot-core-v3-18.04-release Test

Total Test time (real) = 0.62 sec

The following tests FAILED:
24 - py-op-point-modifier (Failed)
Errors while running CTest
Makefile:98: recipe for target 'test' failed
make: *** [test] Error 8
ERROR: Job failed: exit code 1
failed
robotpkg-py-sot-core-v3-py3-18.04-release Test
| See also "/root/robotpkg/wip/py-sot-core-v3/work.runner-sWwLEjyc-project-65-concurrent-0/sot-core-4.7.1/CMakeFiles/CMakeOutput.log".

For details or bug reports, check the complete log file in:
/root/robotpkg/wip/py-sot-core-v3/work.runner-sWwLEjyc-project-65-concurrent-0/configure.log
make: *** [do-configure-cmake] Error 1
/root/robotpkg/mk/configure/cmake-configure.mk:100: recipe for target 'do-configure-cmake' failed
make: *** [install] Error 2
/root/robotpkg/mk/internal/trusted.mk:36: recipe for target 'install' failed
ERROR: Job failed: exit code 1
failed
robotpkg-py-sot-core-v3-py3-16.04-release Test
| See also "/root/robotpkg/wip/py-sot-core-v3/work.runner-ULfN9w-c-project-65-concurrent-4/sot-core-4.7.1/CMakeFiles/CMakeOutput.log".

For details or bug reports, check the complete log file in:
/root/robotpkg/wip/py-sot-core-v3/work.runner-ULfN9w-c-project-65-concurrent-4/configure.log
make: *** [do-configure-cmake] Error 1
/root/robotpkg/mk/configure/cmake-configure.mk:100: recipe for target 'do-configure-cmake' failed
/root/robotpkg/mk/internal/trusted.mk:36: recipe for target 'install' failed
make: *** [install] Error 2
ERROR: Job failed: exit code 1
failed
robotpkg-py-sot-core-v3-py3-stretch-debug Test
| See also "/root/robotpkg/wip/py-sot-core-v3/work.runner-7gqkM7SY-project-65-concurrent-29/sot-core-4.7.1/CMakeFiles/CMakeOutput.log".

For details or bug reports, check the complete log file in:
/root/robotpkg/wip/py-sot-core-v3/work.runner-7gqkM7SY-project-65-concurrent-29/configure.log
make: *** [do-configure-cmake] Error 1
/root/robotpkg/mk/configure/cmake-configure.mk:100: recipe for target 'do-configure-cmake' failed
/root/robotpkg/mk/internal/trusted.mk:36: recipe for target 'install' failed
make: *** [install] Error 2
ERROR: Job failed: exit code 1