Merge remote-tracking branch 'origin/devel' into devel

20 jobs for v4.4.0 in 66 minutes and 48 seconds (queued for 28 minutes and 42 seconds)
latest
Status Name Job ID Coverage
  Test
passed doc-coverage #53507

00:42:48

failed format #53508
allowed to fail

00:01:16

passed robotpkg-py-sot-core-v3-16.04-debug #53492

00:55:09

failed robotpkg-py-sot-core-v3-16.04-release #53489

01:00:01

passed robotpkg-py-sot-core-v3-18.04-debug #53495

00:49:46

passed robotpkg-py-sot-core-v3-18.04-release #53494

00:50:47

failed robotpkg-py-sot-core-v3-py3-16.04-debug #53490
allowed to fail

00:21:07

failed robotpkg-py-sot-core-v3-py3-16.04-release #53491
allowed to fail

00:21:18

failed robotpkg-py-sot-core-v3-py3-18.04-debug #53496
allowed to fail

00:28:23

failed robotpkg-py-sot-core-v3-py3-18.04-release #53493
allowed to fail

00:28:21

failed robotpkg-py-sot-core-v3-py3-stretch-debug #53500

00:07:37

failed robotpkg-py-sot-core-v3-py3-stretch-release #53497

00:10:23

passed robotpkg-py-sot-core-v3-stretch-debug #53498

00:20:47

passed robotpkg-py-sot-core-v3-stretch-release #53499

00:21:07

passed robotpkg-sot-core-v3-16.04-debug #53501

00:31:08

passed robotpkg-sot-core-v3-16.04-release #53502

00:05:18

passed robotpkg-sot-core-v3-18.04-debug #53503

00:07:07

passed robotpkg-sot-core-v3-18.04-release #53504

00:07:28

passed robotpkg-sot-core-v3-stretch-debug #53506

00:26:19

passed robotpkg-sot-core-v3-stretch-release #53505

00:26:45

 
Name Stage Failure
failed
robotpkg-py-sot-core-v3-py3-stretch-debug Test
| See also "/root/robotpkg/wip/py-sot-core-v3/work.runner-sWwLEjyc-project-65-concurrent-0/sot-core-4.7.1/CMakeFiles/CMakeOutput.log".

For details or bug reports, check the complete log file in:
/root/robotpkg/wip/py-sot-core-v3/work.runner-sWwLEjyc-project-65-concurrent-0/configure.log
make: *** [do-configure-cmake] Error 1
/root/robotpkg/mk/configure/cmake-configure.mk:100: recipe for target 'do-configure-cmake' failed
/root/robotpkg/mk/internal/trusted.mk:36: recipe for target 'install' failed
make: *** [install] Error 2
ERROR: Job failed: exit code 1
failed
robotpkg-py-sot-core-v3-py3-stretch-release Test
| See also "/root/robotpkg/wip/py-sot-core-v3/work.runner-ULfN9w-c-project-65-concurrent-0/sot-core-4.7.1/CMakeFiles/CMakeOutput.log".

For details or bug reports, check the complete log file in:
/root/robotpkg/wip/py-sot-core-v3/work.runner-ULfN9w-c-project-65-concurrent-0/configure.log
make: *** [do-configure-cmake] Error 1
/root/robotpkg/mk/configure/cmake-configure.mk:100: recipe for target 'do-configure-cmake' failed
/root/robotpkg/mk/internal/trusted.mk:36: recipe for target 'install' failed
make: *** [install] Error 2
ERROR: Job failed: exit code 1
failed
robotpkg-py-sot-core-v3-16.04-release Test The script exceeded the maximum execution time set for the job
100% tests passed, 0 tests failed out of 23

Total Test time (real) = 0.87 sec
Creating cache default...
ccache: found 1 matching files
No URL provided, cache will be not uploaded to shared cache server. Cache will be stored only locally.

Created cache
Pulling docker image gitlab/gitlab-runner-helper:x86_64-577f813d ...
ERROR: Job failed: execution took longer than 1h0m0s seconds
failed
robotpkg-py-sot-core-v3-py3-18.04-debug Test
| 

For details or bug reports, check the complete log file in:
/root/robotpkg/wip/py-sot-core-v3/work.runner-tRjAffv3-project-65-concurrent-5/configure.log
/root/robotpkg/mk/configure/cmake-configure.mk:100: recipe for target 'do-configure-cmake' failed
make: *** [do-configure-cmake] Error 1
/root/robotpkg/mk/internal/trusted.mk:36: recipe for target 'install' failed
make: *** [install] Error 2
ERROR: Job failed: exit code 1
failed
robotpkg-py-sot-core-v3-py3-16.04-release Test
| See also "/root/robotpkg/wip/py-sot-core-v3/work.runner-tRjAffv3-project-65-concurrent-3/sot-core-4.7.1/CMakeFiles/CMakeOutput.log".
For details or bug reports, check the complete log file in:
/root/robotpkg/wip/py-sot-core-v3/work.runner-tRjAffv3-project-65-concurrent-3/configure.log

/root/robotpkg/mk/configure/cmake-configure.mk:100: recipe for target 'do-configure-cmake' failed
make: *** [do-configure-cmake] Error 1
/root/robotpkg/mk/internal/trusted.mk:36: recipe for target 'install' failed
make: *** [install] Error 2
ERROR: Job failed: exit code 1
failed
robotpkg-py-sot-core-v3-py3-16.04-debug Test
| See also "/root/robotpkg/wip/py-sot-core-v3/work.runner-tRjAffv3-project-65-concurrent-2/sot-core-4.7.1/CMakeFiles/CMakeOutput.log".

For details or bug reports, check the complete log file in:
/root/robotpkg/wip/py-sot-core-v3/work.runner-tRjAffv3-project-65-concurrent-2/configure.log
make: *** [do-configure-cmake] Error 1
/root/robotpkg/mk/configure/cmake-configure.mk:100: recipe for target 'do-configure-cmake' failed
/root/robotpkg/mk/internal/trusted.mk:36: recipe for target 'install' failed
make: *** [install] Error 2
ERROR: Job failed: exit code 1
failed
robotpkg-py-sot-core-v3-py3-18.04-release Test
| See also "/root/robotpkg/wip/py-sot-core-v3/work.runner-tRjAffv3-project-65-concurrent-4/sot-core-4.7.1/CMakeFiles/CMakeOutput.log".
For details or bug reports, check the complete log file in:
/root/robotpkg/wip/py-sot-core-v3/work.runner-tRjAffv3-project-65-concurrent-4/configure.log

/root/robotpkg/mk/configure/cmake-configure.mk:100: recipe for target 'do-configure-cmake' failed
make: *** [do-configure-cmake] Error 1
make: *** [install] Error 2
/root/robotpkg/mk/internal/trusted.mk:36: recipe for target 'install' failed
ERROR: Job failed: exit code 1
failed
format Test
+  tracer->addSignalToTrace(sig1);
+ tracer->openFiles("/tmp/sot-core", "tr_", ".dat");

- tracer->addSignalToTrace( sig2 );
+ tracer->addSignalToTrace(sig2);

return 0;
}
ERROR: Job failed: exit code 1