Fix header install

20 jobs for v4.3.0 in 76 minutes and 23 seconds (queued for 10 minutes and 51 seconds)
latest
Name Stage Failure
failed
robotpkg-py-sot-core-v3-py3-stretch-release Test The script exceeded the maximum execution time set for the job
WARNING: Cannot check installed version of dynamic-graph-v3
WARNING: Using octomap-1.9.0 in /opt/openrobots
WARNING: The following packages may interfere with the build because they
WARNING: are located in paths used by other dependencies:
WARNING: octomap-1.8.1 in /usr
===> Configuring for sot-core-v3-4.7.1pl1211161257
===> Building for sot-core-v3-4.7.1pl1211161257
Pulling docker image gitlab/gitlab-runner-helper:x86_64-577f813d ...
ERROR: Job failed: execution took longer than 1h0m0s seconds
failed
robotpkg-sot-core-v3-16.04-debug Test There has been a runner system failure, please try again
 * [new tag]         v4.7.0              -> v4.7.0
* [new tag] v4.7.1 -> v4.7.1
Checking out 4b27663c as v4.3.0...

Skipping Git submodules setup
Checking cache for default...
No URL provided, cache will not be downloaded from shared cache server. Instead a local version of cache will be extracted.
Successfully extracted cache
ERROR: Job failed (system failure): Cannot connect to the Docker daemon at unix:///var/run/docker.sock. Is the docker daemon running? (executor_docker.go:740:120s)
failed
robotpkg-py-sot-core-v3-stretch-debug Test The script exceeded the maximum execution time set for the job
WARNING: Cannot check installed version of dynamic-graph-v3
WARNING: Using octomap-1.9.0 in /opt/openrobots
WARNING: The following packages may interfere with the build because they
WARNING: are located in paths used by other dependencies:
WARNING: octomap-1.8.1 in /usr
===> Configuring for sot-core-v3-4.7.1pl1211161308
===> Building for sot-core-v3-4.7.1pl1211161308
Pulling docker image gitlab/gitlab-runner-helper:x86_64-577f813d ...
ERROR: Job failed: execution took longer than 1h0m0s seconds
failed
robotpkg-sot-core-v3-16.04-release Test There has been a runner system failure, please try again
 * [new tag]         v4.7.0              -> v4.7.0
* [new tag] v4.7.1 -> v4.7.1
Checking out 4b27663c as v4.3.0...

Skipping Git submodules setup
Checking cache for default...
No URL provided, cache will not be downloaded from shared cache server. Instead a local version of cache will be extracted.
Successfully extracted cache
ERROR: Job failed (system failure): Cannot connect to the Docker daemon at unix:///var/run/docker.sock. Is the docker daemon running? (executor_docker.go:740:120s)
failed
robotpkg-sot-core-v3-18.04-debug Test There has been a runner system failure, please try again
 * [new tag]         v4.4.0              -> v4.4.0
* [new tag] v4.5.0 -> v4.5.0
* [new tag] v4.6.0 -> v4.6.0
* [new tag] v4.7.0 -> v4.7.0
* [new tag] v4.7.1 -> v4.7.1
Checking out 4b27663c as v4.3.0...

Skipping Git submodules setup
ERROR: Job failed (system failure): Cannot connect to the Docker daemon at unix:///var/run/docker.sock. Is the docker daemon running? (executor_docker.go:740:120s)
failed
robotpkg-py-sot-core-v3-py3-stretch-debug Test There has been a runner system failure, please try again
 * [new tag]         v4.7.0              -> v4.7.0
* [new tag] v4.7.1 -> v4.7.1
Checking out 4b27663c as v4.3.0...

Skipping Git submodules setup
Checking cache for default...
No URL provided, cache will not be downloaded from shared cache server. Instead a local version of cache will be extracted.
Successfully extracted cache
ERROR: Job failed (system failure): Cannot connect to the Docker daemon at unix:///var/run/docker.sock. Is the docker daemon running? (executor_docker.go:740:120s)
failed
doc-coverage Test The script exceeded the maximum execution time set for the job
robotpkg_admin: sot-core-v3-4.7.1pl1211162044~debug: File `/opt/openrobots/lib/plugin/vector-constant.so.4.7.1' is in +CONTENTS but not on filesystem!
robotpkg_admin: sot-core-v3-4.7.1pl1211162044~debug: File `/opt/openrobots/lib/plugin/vector-to-rotation.so.4.7.1' is in +CONTENTS but not on filesystem!
robotpkg_admin: sot-core-v3-4.7.1pl1211162044~debug: File `/opt/openrobots/lib/plugin/visual-point-projecter.so.4.7.1' is in +CONTENTS but not on filesystem!
===> Done install for sot-core-v3-4.7.1pl1211162044~debug
=> Returning to build of py27-sot-core-v3-4.7.1pl1211162044~debug
===> Configuring for py27-sot-core-v3-4.7.1pl1211162044~debug
===> Building for py27-sot-core-v3-4.7.1pl1211162044~debug
Pulling docker image gitlab/gitlab-runner-helper:x86_64-577f813d ...
ERROR: Job failed: execution took longer than 1h0m0s seconds
failed
robotpkg-py-sot-core-v3-py3-18.04-debug Test The script exceeded the maximum execution time set for the job
^~~~
/root/robotpkg/wip/sot-core-v3/work.runner-7gqkM7SY-project-65-concurrent-18/sot-core-4.7.1/src/tools/device.cpp:371:9: warning: this statement may fall through [-Wimplicit-fallthrough=]
if ( s != lowerVelocity_.size()
^~
/root/robotpkg/wip/sot-core-v3/work.runner-7gqkM7SY-project-65-concurrent-18/sot-core-4.7.1/src/tools/device.cpp:376:7: note: here
case CONTROL_INPUT_NO_INTEGRATION:
^~~~
Pulling docker image gitlab/gitlab-runner-helper:x86_64-577f813d ...
ERROR: Job failed: execution took longer than 1h0m0s seconds
failed
robotpkg-py-sot-core-v3-18.04-debug Test The script exceeded the maximum execution time set for the job
/root/robotpkg/wip/sot-core-v3/work.runner-7gqkM7SY-project-65-concurrent-17/sot-core-4.7.1/src/tools/device.cpp:371:9: warning: this statement may fall through [-Wimplicit-fallthrough=]
if ( s != lowerVelocity_.size()
^~
/root/robotpkg/wip/sot-core-v3/work.runner-7gqkM7SY-project-65-concurrent-17/sot-core-4.7.1/src/tools/device.cpp:376:7: note: here
case CONTROL_INPUT_NO_INTEGRATION:
^~~~
===> Installing for sot-core-v3-4.7.1pl1211161216
Pulling docker image gitlab/gitlab-runner-helper:x86_64-577f813d ...
ERROR: Job failed: execution took longer than 1h0m0s seconds
failed
robotpkg-py-sot-core-v3-18.04-release Test The script exceeded the maximum execution time set for the job
/root/robotpkg/wip/sot-core-v3/work.runner-7gqkM7SY-project-65-concurrent-16/sot-core-4.7.1/src/tools/device.cpp:371:9: warning: this statement may fall through [-Wimplicit-fallthrough=]
if ( s != lowerVelocity_.size()
^~
/root/robotpkg/wip/sot-core-v3/work.runner-7gqkM7SY-project-65-concurrent-16/sot-core-4.7.1/src/tools/device.cpp:376:7: note: here
case CONTROL_INPUT_NO_INTEGRATION:
^~~~
===> Installing for sot-core-v3-4.7.1pl1211161222
Pulling docker image gitlab/gitlab-runner-helper:x86_64-577f813d ...
ERROR: Job failed: execution took longer than 1h0m0s seconds
failed
robotpkg-py-sot-core-v3-py3-18.04-release Test The script exceeded the maximum execution time set for the job
robotpkg_admin: sot-core-v3-4.7.1pl1211161145: File `/opt/openrobots/lib/plugin/timer.so.4.7.1' is in +CONTENTS but not on filesystem!
robotpkg_admin: sot-core-v3-4.7.1pl1211161145: File `/opt/openrobots/lib/plugin/vector-constant.so.4.7.1' is in +CONTENTS but not on filesystem!
robotpkg_admin: sot-core-v3-4.7.1pl1211161145: File `/opt/openrobots/lib/plugin/vector-to-rotation.so.4.7.1' is in +CONTENTS but not on filesystem!
robotpkg_admin: sot-core-v3-4.7.1pl1211161145: File `/opt/openrobots/lib/plugin/visual-point-projecter.so.4.7.1' is in +CONTENTS but not on filesystem!
===> Done install for sot-core-v3-4.7.1pl1211161145
=> Returning to build of py36-sot-core-v3-4.7.1pl1211161145
===> Configuring for py36-sot-core-v3-4.7.1pl1211161145
Pulling docker image gitlab/gitlab-runner-helper:x86_64-577f813d ...
ERROR: Job failed: execution took longer than 1h0m0s seconds
failed
robotpkg-py-sot-core-v3-16.04-debug Test The script exceeded the maximum execution time set for the job
robotpkg_admin: sot-core-v3-4.7.1pl1211161156: File `/opt/openrobots/lib/plugin/vector-constant.so.4.7.1' is in +CONTENTS but not on filesystem!
robotpkg_admin: sot-core-v3-4.7.1pl1211161156: File `/opt/openrobots/lib/plugin/vector-to-rotation.so.4.7.1' is in +CONTENTS but not on filesystem!
robotpkg_admin: sot-core-v3-4.7.1pl1211161156: File `/opt/openrobots/lib/plugin/visual-point-projecter.so.4.7.1' is in +CONTENTS but not on filesystem!
===> Done install for sot-core-v3-4.7.1pl1211161156
=> Returning to build of py27-sot-core-v3-4.7.1pl1211161156~debug
===> Configuring for py27-sot-core-v3-4.7.1pl1211161156~debug
===> Building for py27-sot-core-v3-4.7.1pl1211161156~debug
Pulling docker image gitlab/gitlab-runner-helper:x86_64-577f813d ...
ERROR: Job failed: execution took longer than 1h0m0s seconds
failed
robotpkg-py-sot-core-v3-16.04-release Test The script exceeded the maximum execution time set for the job
robotpkg_admin: sot-core-v3-4.7.1pl1211161112: File `/opt/openrobots/lib/plugin/vector-constant.so.4.7.1' is in +CONTENTS but not on filesystem!
robotpkg_admin: sot-core-v3-4.7.1pl1211161112: File `/opt/openrobots/lib/plugin/vector-to-rotation.so.4.7.1' is in +CONTENTS but not on filesystem!
robotpkg_admin: sot-core-v3-4.7.1pl1211161112: File `/opt/openrobots/lib/plugin/visual-point-projecter.so.4.7.1' is in +CONTENTS but not on filesystem!
===> Done install for sot-core-v3-4.7.1pl1211161112
=> Returning to build of py27-sot-core-v3-4.7.1pl1211161112
===> Configuring for py27-sot-core-v3-4.7.1pl1211161112
===> Building for py27-sot-core-v3-4.7.1pl1211161112
Pulling docker image gitlab/gitlab-runner-helper:x86_64-577f813d ...
ERROR: Job failed: execution took longer than 1h0m0s seconds
failed
robotpkg-py-sot-core-v3-py3-16.04-release Test
| -- Configuring incomplete, errors occurred!
| See also "/root/robotpkg/wip/py-sot-core-v3/work.runner-7gqkM7SY-project-65-concurrent-13/sot-core-4.7.1/CMakeFiles/CMakeOutput.log".
For details or bug reports, check the complete log file in:
/root/robotpkg/wip/py-sot-core-v3/work.runner-7gqkM7SY-project-65-concurrent-13/configure.log
/root/robotpkg/mk/configure/cmake-configure.mk:100: recipe for target 'do-configure-cmake' failed
make: *** [do-configure-cmake] Error 1
/root/robotpkg/mk/internal/trusted.mk:36: recipe for target 'install' failed
make: *** [install] Error 2
ERROR: Job failed: exit code 1
failed
robotpkg-py-sot-core-v3-py3-16.04-debug Test
| See also "/root/robotpkg/wip/py-sot-core-v3/work.runner-7gqkM7SY-project-65-concurrent-12/sot-core-4.7.1/CMakeFiles/CMakeOutput.log".
For details or bug reports, check the complete log file in:
/root/robotpkg/wip/py-sot-core-v3/work.runner-7gqkM7SY-project-65-concurrent-12/configure.log

/root/robotpkg/mk/configure/cmake-configure.mk:100: recipe for target 'do-configure-cmake' failed
make: *** [do-configure-cmake] Error 1
/root/robotpkg/mk/internal/trusted.mk:36: recipe for target 'install' failed
make: *** [install] Error 2
ERROR: Job failed: exit code 1
failed
format Test
+  tracer->addSignalToTrace(sig1);
+ tracer->openFiles("/tmp/sot-core", "tr_", ".dat");

- tracer->addSignalToTrace( sig2 );
+ tracer->addSignalToTrace(sig2);

return 0;
}
ERROR: Job failed: exit code 1
failed
robotpkg-py-sot-core-v3-stretch-release Test There has been a runner system failure, please try again
 * [new tag]         v4.7.0              -> v4.7.0
* [new tag] v4.7.1 -> v4.7.1
Checking out 4b27663c as v4.3.0...

Skipping Git submodules setup
Checking cache for default...
No URL provided, cache will not be downloaded from shared cache server. Instead a local version of cache will be extracted.
Successfully extracted cache
ERROR: Job failed (system failure): Cannot connect to the Docker daemon at unix:///var/run/docker.sock. Is the docker daemon running? (executor_docker.go:740:120s)