v4.11.6

10 jobs for master in 1 minute and 6 seconds (queued for 1 second)
latest
Name Stage Failure
failed
robotpkg-sot-core-v3-ferrum Test
For details or bug reports, check the complete log file in:
/root/robotpkg/wip/sot-core-v3/work/extract.log

make: *** [do-checkout] Error 1
/root/robotpkg/mk/extract/checkout.mk:225: recipe for target 'do-checkout' failed
/root/robotpkg/mk/internal/trusted.mk:36: recipe for target 'checkout' failed
make: *** [checkout] Error 2
Cleaning up project directory and file based variables
ERROR: Job failed: exit code 1

failed
robotpkg-py-sot-core-v3-ferrum Test

For details or bug reports, check the complete log file in:
/root/robotpkg/wip/sot-core-v3/work/extract.log
make: *** [do-checkout] Error 1
/root/robotpkg/mk/extract/checkout.mk:225: recipe for target 'do-checkout' failed
make: *** [checkout] Error 2
/root/robotpkg/mk/internal/trusted.mk:36: recipe for target 'checkout' failed
Cleaning up project directory and file based variables
ERROR: Job failed: exit code 1

failed
robotpkg-py-sot-core-v3-buster Test
| fatal: clone of 'git://github.com/jrl-umi3218/jrl-travis' into submodule path '/root/robotpkg/wip/sot-core-v3/work/sot-core-4.11.6/.travis' failed
| Failed to clone '.travis' a second time, aborting

For details or bug reports, check the complete log file in:
/root/robotpkg/wip/sot-core-v3/work/extract.log
make: *** [/root/robotpkg/mk/extract/checkout.mk:226: do-checkout] Error 1
make: *** [/root/robotpkg/mk/internal/trusted.mk:36: checkout] Error 2
Cleaning up project directory and file based variables
ERROR: Job failed: exit code 1

failed
robotpkg-sot-core-v3-buster Test
| fatal: clone of 'git://github.com/jrl-umi3218/jrl-cmakemodules.git' into submodule path '/root/robotpkg/wip/sot-core-v3/work/sot-core-4.11.6/cmake' failed
| Failed to clone 'cmake' a second time, aborting

For details or bug reports, check the complete log file in:
/root/robotpkg/wip/sot-core-v3/work/extract.log
make: *** [/root/robotpkg/mk/extract/checkout.mk:226: do-checkout] Error 1
make: *** [/root/robotpkg/mk/internal/trusted.mk:36: checkout] Error 2
Cleaning up project directory and file based variables
ERROR: Job failed: exit code 1

failed
robotpkg-py-sot-core-v3-20.04 Test
| fatal: clone of 'git://github.com/jrl-umi3218/jrl-travis' into submodule path '/root/robotpkg/wip/sot-core-v3/work/sot-core-4.11.6/.travis' failed
| Failed to clone '.travis' a second time, aborting

For details or bug reports, check the complete log file in:
/root/robotpkg/wip/sot-core-v3/work/extract.log
make: *** [/root/robotpkg/mk/extract/checkout.mk:226: do-checkout] Error 1
make: *** [/root/robotpkg/mk/internal/trusted.mk:36: checkout] Error 2
Cleaning up project directory and file based variables
ERROR: Job failed: exit code 1

failed
robotpkg-sot-core-v3-18.04 Test

For details or bug reports, check the complete log file in:
/root/robotpkg/wip/sot-core-v3/work/extract.log
make: *** [do-checkout] Error 1
/root/robotpkg/mk/extract/checkout.mk:225: recipe for target 'do-checkout' failed
make: *** [checkout] Error 2
/root/robotpkg/mk/internal/trusted.mk:36: recipe for target 'checkout' failed
Cleaning up project directory and file based variables
ERROR: Job failed: exit code 1

failed
format Test
+#include <iostream>
#include <sot/core/debug.hh>

using namespace std;
++ git diff --ignore-submodules
++ wc -l
+ exit 13963
Cleaning up project directory and file based variables
ERROR: Job failed: exit code 1

failed
doc-coverage Test
make: *** [/root/robotpkg/mk/extract/checkout.mk:226: do-checkout] Error 1
make: *** [/root/robotpkg/mk/internal/trusted.mk:36: checkout] Error 2
Running after_script
Running after script...
$ cd /root/robotpkg/wip/py-sot-core-v3
$ build=$(make show-var VARNAME=CONFIGURE_DIRS); cd $(make show-var VARNAME=WRKSRC); cd $build
/usr/bin/bash: line 123: cd: /root/robotpkg/wip/py-sot-core-v3/work/sot-core-4.11.6: No such file or directory
Cleaning up project directory and file based variables
ERROR: Job failed: exit code 1

failed
robotpkg-sot-core-v3-20.04 Test
| fatal: clone of 'git://github.com/jrl-umi3218/jrl-travis' into submodule path '/root/robotpkg/wip/sot-core-v3/work/sot-core-4.11.6/.travis' failed
| Failed to clone '.travis' a second time, aborting

For details or bug reports, check the complete log file in:
/root/robotpkg/wip/sot-core-v3/work/extract.log
make: *** [/root/robotpkg/mk/extract/checkout.mk:226: do-checkout] Error 1
make: *** [/root/robotpkg/mk/internal/trusted.mk:36: checkout] Error 2
Cleaning up project directory and file based variables
ERROR: Job failed: exit code 1

failed
robotpkg-py-sot-core-v3-18.04 Test
For details or bug reports, check the complete log file in:
/root/robotpkg/wip/sot-core-v3/work/extract.log

/root/robotpkg/mk/extract/checkout.mk:225: recipe for target 'do-checkout' failed
make: *** [do-checkout] Error 1
/root/robotpkg/mk/internal/trusted.mk:36: recipe for target 'checkout' failed
make: *** [checkout] Error 2
Cleaning up project directory and file based variables
ERROR: Job failed: exit code 1