[format][gepetto-linters]

10 jobs for pr/194 in 15 minutes (queued for 3 seconds)
Name Stage Failure
failed
robotpkg-sot-core-v3-ferrum Test

For details or bug reports, check the complete log file in:
/root/robotpkg/wip/sot-core-v3/work/configure.log
/root/robotpkg/mk/configure/cmake-configure.mk:100: recipe for target 'do-configure-cmake' failed
make: *** [do-configure-cmake] Error 1
make: *** [install] Error 2
/root/robotpkg/mk/internal/trusted.mk:36: recipe for target 'install' failed
Cleaning up project directory and file based variables
ERROR: Job failed: exit code 1

failed
robotpkg-sot-core-v3-18.04 Test

For details or bug reports, check the complete log file in:
/root/robotpkg/wip/sot-core-v3/work/configure.log
/root/robotpkg/mk/configure/cmake-configure.mk:100: recipe for target 'do-configure-cmake' failed
make: *** [do-configure-cmake] Error 1
/root/robotpkg/mk/internal/trusted.mk:36: recipe for target 'install' failed
make: *** [install] Error 2
Cleaning up project directory and file based variables
ERROR: Job failed: exit code 1

failed
robotpkg-sot-core-v3-20.04 Test
| See also "/root/robotpkg/wip/sot-core-v3/work/sot-core-4.11.6/CMakeFiles/CMakeOutput.log".
| See also "/root/robotpkg/wip/sot-core-v3/work/sot-core-4.11.6/CMakeFiles/CMakeError.log".

For details or bug reports, check the complete log file in:
/root/robotpkg/wip/sot-core-v3/work/configure.log
make: *** [/root/robotpkg/mk/configure/cmake-configure.mk:100: do-configure-cmake] Error 1
make: *** [/root/robotpkg/mk/internal/trusted.mk:36: install] Error 2
Cleaning up project directory and file based variables
ERROR: Job failed: exit code 1

failed
robotpkg-sot-core-v3-buster Test
| See also "/root/robotpkg/wip/sot-core-v3/work/sot-core-4.11.6/CMakeFiles/CMakeOutput.log".
| See also "/root/robotpkg/wip/sot-core-v3/work/sot-core-4.11.6/CMakeFiles/CMakeError.log".

For details or bug reports, check the complete log file in:
/root/robotpkg/wip/sot-core-v3/work/configure.log
make: *** [/root/robotpkg/mk/configure/cmake-configure.mk:100: do-configure-cmake] Error 1
make: *** [/root/robotpkg/mk/internal/trusted.mk:36: install] Error 2
Cleaning up project directory and file based variables
ERROR: Job failed: exit code 1

failed
format Test
+ shift
+ [[ 0 -gt 0 ]]
+ true
+ find . -path ./cmake -prune -o -iregex '.*\.\(h\|c\|hh\|cc\|hpp\|cpp\|hxx\|cxx\)$' -exec clang-format-6.0 -i '{}' +
+ true
+ flake8 .
./tests/tools/bad_python_script.py:2:7: F821 undefined name 'b'
Cleaning up project directory and file based variables
ERROR: Job failed: exit code 1