[format][gepetto-linters]

10 jobs for pr/194 in 15 minutes (queued for 3 seconds)
Status Name Job ID Coverage
  Test
passed doc-coverage #135587

00:14:58

34.0%
failed format #135588

00:00:07

passed robotpkg-py-sot-core-v3-18.04 #135579

00:12:20

passed robotpkg-py-sot-core-v3-20.04 #135580

00:12:37

passed robotpkg-py-sot-core-v3-buster #135581

00:08:48

passed robotpkg-py-sot-core-v3-ferrum #135582

00:06:15

failed robotpkg-sot-core-v3-18.04 #135583
allowed to fail

00:00:50

failed robotpkg-sot-core-v3-20.04 #135584
allowed to fail

00:00:41

failed robotpkg-sot-core-v3-buster #135585
allowed to fail

00:00:11

failed robotpkg-sot-core-v3-ferrum #135586
allowed to fail

00:08:37

 
Name Stage Failure
failed
robotpkg-sot-core-v3-ferrum Test

For details or bug reports, check the complete log file in:
/root/robotpkg/wip/sot-core-v3/work/configure.log
/root/robotpkg/mk/configure/cmake-configure.mk:100: recipe for target 'do-configure-cmake' failed
make: *** [do-configure-cmake] Error 1
make: *** [install] Error 2
/root/robotpkg/mk/internal/trusted.mk:36: recipe for target 'install' failed
Cleaning up project directory and file based variables
ERROR: Job failed: exit code 1

failed
robotpkg-sot-core-v3-18.04 Test

For details or bug reports, check the complete log file in:
/root/robotpkg/wip/sot-core-v3/work/configure.log
/root/robotpkg/mk/configure/cmake-configure.mk:100: recipe for target 'do-configure-cmake' failed
make: *** [do-configure-cmake] Error 1
/root/robotpkg/mk/internal/trusted.mk:36: recipe for target 'install' failed
make: *** [install] Error 2
Cleaning up project directory and file based variables
ERROR: Job failed: exit code 1

failed
robotpkg-sot-core-v3-20.04 Test
| See also "/root/robotpkg/wip/sot-core-v3/work/sot-core-4.11.6/CMakeFiles/CMakeOutput.log".
| See also "/root/robotpkg/wip/sot-core-v3/work/sot-core-4.11.6/CMakeFiles/CMakeError.log".

For details or bug reports, check the complete log file in:
/root/robotpkg/wip/sot-core-v3/work/configure.log
make: *** [/root/robotpkg/mk/configure/cmake-configure.mk:100: do-configure-cmake] Error 1
make: *** [/root/robotpkg/mk/internal/trusted.mk:36: install] Error 2
Cleaning up project directory and file based variables
ERROR: Job failed: exit code 1

failed
robotpkg-sot-core-v3-buster Test
| See also "/root/robotpkg/wip/sot-core-v3/work/sot-core-4.11.6/CMakeFiles/CMakeOutput.log".
| See also "/root/robotpkg/wip/sot-core-v3/work/sot-core-4.11.6/CMakeFiles/CMakeError.log".

For details or bug reports, check the complete log file in:
/root/robotpkg/wip/sot-core-v3/work/configure.log
make: *** [/root/robotpkg/mk/configure/cmake-configure.mk:100: do-configure-cmake] Error 1
make: *** [/root/robotpkg/mk/internal/trusted.mk:36: install] Error 2
Cleaning up project directory and file based variables
ERROR: Job failed: exit code 1

failed
format Test
+ shift
+ [[ 0 -gt 0 ]]
+ true
+ find . -path ./cmake -prune -o -iregex '.*\.\(h\|c\|hh\|cc\|hpp\|cpp\|hxx\|cxx\)$' -exec clang-format-6.0 -i '{}' +
+ true
+ flake8 .
./tests/tools/bad_python_script.py:2:7: F821 undefined name 'b'
Cleaning up project directory and file based variables
ERROR: Job failed: exit code 1