[tools][hardware-control-interface] Implements unit-test for the sot_loader class.

10 jobs for pr/194 in 13 minutes and 16 seconds (queued for 3 seconds)
Status Name Job ID Coverage
  Test
passed doc-coverage #135577

00:13:14

34.0%
failed format #135578

00:00:08

passed robotpkg-py-sot-core-v3-18.04 #135569

00:10:24

passed robotpkg-py-sot-core-v3-20.04 #135570

00:11:11

passed robotpkg-py-sot-core-v3-buster #135571

00:13:14

passed robotpkg-py-sot-core-v3-ferrum #135572

00:11:08

failed robotpkg-sot-core-v3-18.04 #135573
allowed to fail

00:01:43

failed robotpkg-sot-core-v3-20.04 #135574
allowed to fail

00:00:10

failed robotpkg-sot-core-v3-buster #135575
allowed to fail

00:02:05

failed robotpkg-sot-core-v3-ferrum #135576
allowed to fail

00:01:44

 
Name Stage Failure
failed
robotpkg-sot-core-v3-buster Test
| See also "/root/robotpkg/wip/sot-core-v3/work/sot-core-4.11.6/CMakeFiles/CMakeOutput.log".
| See also "/root/robotpkg/wip/sot-core-v3/work/sot-core-4.11.6/CMakeFiles/CMakeError.log".

For details or bug reports, check the complete log file in:
/root/robotpkg/wip/sot-core-v3/work/configure.log
make: *** [/root/robotpkg/mk/configure/cmake-configure.mk:100: do-configure-cmake] Error 1
make: *** [/root/robotpkg/mk/internal/trusted.mk:36: install] Error 2
Cleaning up project directory and file based variables
ERROR: Job failed: exit code 1

failed
robotpkg-sot-core-v3-ferrum Test

For details or bug reports, check the complete log file in:
/root/robotpkg/wip/sot-core-v3/work/configure.log
make: *** [do-configure-cmake] Error 1
/root/robotpkg/mk/configure/cmake-configure.mk:100: recipe for target 'do-configure-cmake' failed
make: *** [install] Error 2
/root/robotpkg/mk/internal/trusted.mk:36: recipe for target 'install' failed
Cleaning up project directory and file based variables
ERROR: Job failed: exit code 1

failed
robotpkg-sot-core-v3-18.04 Test
For details or bug reports, check the complete log file in:
/root/robotpkg/wip/sot-core-v3/work/configure.log

make: *** [do-configure-cmake] Error 1
/root/robotpkg/mk/configure/cmake-configure.mk:100: recipe for target 'do-configure-cmake' failed
/root/robotpkg/mk/internal/trusted.mk:36: recipe for target 'install' failed
make: *** [install] Error 2
Cleaning up project directory and file based variables
ERROR: Job failed: exit code 1

failed
robotpkg-sot-core-v3-20.04 Test
| See also "/root/robotpkg/wip/sot-core-v3/work/sot-core-4.11.6/CMakeFiles/CMakeOutput.log".
| See also "/root/robotpkg/wip/sot-core-v3/work/sot-core-4.11.6/CMakeFiles/CMakeError.log".

For details or bug reports, check the complete log file in:
/root/robotpkg/wip/sot-core-v3/work/configure.log
make: *** [/root/robotpkg/mk/configure/cmake-configure.mk:100: do-configure-cmake] Error 1
make: *** [/root/robotpkg/mk/internal/trusted.mk:36: install] Error 2
Cleaning up project directory and file based variables
ERROR: Job failed: exit code 1

failed
format Test
+ true
+ find . -path ./cmake -prune -o -iregex '.*\.\(h\|c\|hh\|cc\|hpp\|cpp\|hxx\|cxx\)$' -exec clang-format-6.0 -i '{}' +
+ true
+ flake8 .
./tests/tools/bad_python_script.py:2:7: F821 undefined name 'b'
./tests/tools/bad_python_script.py:2:9: W292 no newline at end of file
./tests/tools/good_python_script.py:3:9: W292 no newline at end of file
Cleaning up project directory and file based variables
ERROR: Job failed: exit code 1