v0.4.0

39 jobs for v0.4.0 in 30 minutes and 16 seconds (queued for 73 minutes and 12 seconds)
latest
Status Name Job ID Coverage
  Test
passed doc-coverage #74295

00:05:11

0.0%
failed format #74331
allowed to fail

00:00:21

passed robotpkg-py-roscontrol-sot-16.04-debug #74304

00:05:28

passed robotpkg-py-roscontrol-sot-16.04-release #74194

00:12:43

passed robotpkg-py-roscontrol-sot-18.04-debug #74197

00:12:48

passed robotpkg-py-roscontrol-sot-18.04-release #74292

00:09:39

failed robotpkg-py-roscontrol-sot-stretch-debug #74332
allowed to fail

00:00:46

failed robotpkg-py-roscontrol-sot-stretch-release #74333
allowed to fail

00:00:35

failed doc-coverage #74200

00:10:11

failed doc-coverage #70953

00:10:49

failed doc-coverage #70159

00:00:14

failed doc-coverage #69655

00:00:00

failed format #74201
allowed to fail

00:09:29

failed format #70954
allowed to fail

00:00:13

failed format #70191
allowed to fail

00:00:12

failed format #69656
allowed to fail

00:14:13

failed robotpkg-py-roscontrol-sot-16.04-debug #74195

00:10:12

failed robotpkg-py-roscontrol-sot-16.04-debug #70948

00:00:16

failed robotpkg-py-roscontrol-sot-16.04-debug #70123

00:00:15

failed robotpkg-py-roscontrol-sot-16.04-debug #69650

00:05:59

failed robotpkg-py-roscontrol-sot-16.04-release #70947

00:15:51

failed robotpkg-py-roscontrol-sot-16.04-release #69649

00:00:14

failed robotpkg-py-roscontrol-sot-18.04-debug #70950

00:00:28

failed robotpkg-py-roscontrol-sot-18.04-debug #70156

00:00:14

failed robotpkg-py-roscontrol-sot-18.04-debug #69652

00:02:00

failed robotpkg-py-roscontrol-sot-18.04-release #74196

00:08:11

failed robotpkg-py-roscontrol-sot-18.04-release #70949

00:00:32

failed robotpkg-py-roscontrol-sot-18.04-release #70149

00:00:15

failed robotpkg-py-roscontrol-sot-18.04-release #69651

00:03:26

failed robotpkg-py-roscontrol-sot-stretch-debug #74293
allowed to fail

00:00:00

failed robotpkg-py-roscontrol-sot-stretch-debug #74199
allowed to fail

00:07:17

failed robotpkg-py-roscontrol-sot-stretch-debug #70952
allowed to fail

00:10:41

failed robotpkg-py-roscontrol-sot-stretch-debug #70158
allowed to fail

00:00:14

failed robotpkg-py-roscontrol-sot-stretch-debug #69654
allowed to fail

00:00:00

failed robotpkg-py-roscontrol-sot-stretch-release #74294
allowed to fail

00:00:00

failed robotpkg-py-roscontrol-sot-stretch-release #74198
allowed to fail

00:04:59

failed robotpkg-py-roscontrol-sot-stretch-release #70951
allowed to fail

00:00:14

failed robotpkg-py-roscontrol-sot-stretch-release #70157
allowed to fail

00:00:16

failed robotpkg-py-roscontrol-sot-stretch-release #69653
allowed to fail

00:00:00

 
Name Stage Failure
failed
format Test
+          "Failure happened during one_iteration evaluation: "
+ "unknown exception\nUse gdb to investiguate the problem\n"
+ << __FILE__ << ":" << __LINE__);
throw;
}
} else {
Running after_script
Uploading artifacts for failed job
ERROR: Job failed: exit code 1
failed
robotpkg-py-roscontrol-sot-stretch-release Test
ERROR: See /root/robotpkg/wip/py-roscontrol-sot/work.runner-qTZ7NXCE-project-130-concurrent-0/sysdep.log for details.
ERROR: ======================================================================
/root/robotpkg/mk/depends/depends.mk:70: recipe for target 'do-depends' failed
make: *** [do-depends] Error 1
/root/robotpkg/mk/internal/trusted.mk:36: recipe for target 'install' failed
make: *** [install] Error 2
Running after_script
Uploading artifacts for failed job
ERROR: Job failed: exit code 1
failed
robotpkg-py-roscontrol-sot-stretch-debug Test
ERROR: See /root/robotpkg/wip/py-roscontrol-sot/work.runner-qTZ7NXCE-project-130-concurrent-1/sysdep.log for details.
ERROR: ======================================================================
/root/robotpkg/mk/depends/depends.mk:70: recipe for target 'do-depends' failed
make: *** [do-depends] Error 1
/root/robotpkg/mk/internal/trusted.mk:36: recipe for target 'install' failed
make: *** [install] Error 2
Running after_script
Uploading artifacts for failed job
ERROR: Job failed: exit code 1