[Tests] Only check for python 3

6 jobs for pr/28 in 30 seconds (queued for 8 seconds)
Name Stage Failure
failed
robotpkg-py-roscontrol-sot-20.04 Test
| See also "/root/robotpkg/wip/py-roscontrol-sot/work/roscontrol_sot-0.6.0/CMakeFiles/CMakeOutput.log".
| See also "/root/robotpkg/wip/py-roscontrol-sot/work/roscontrol_sot-0.6.0/CMakeFiles/CMakeError.log".
For details or bug reports, check the complete log file in:
/root/robotpkg/wip/py-roscontrol-sot/work/configure.log

make: *** [/root/robotpkg/mk/configure/cmake-configure.mk:100: do-configure-cmake] Error 1
make: *** [/root/robotpkg/mk/internal/trusted.mk:36: install] Error 2
Cleaning up project directory and file based variables
ERROR: Job failed: exit code 1

failed
robotpkg-py-roscontrol-sot-18.04 Test

For details or bug reports, check the complete log file in:
/root/robotpkg/wip/py-roscontrol-sot/work/configure.log
/root/robotpkg/mk/configure/cmake-configure.mk:100: recipe for target 'do-configure-cmake' failed
make: *** [do-configure-cmake] Error 1
make: *** [install] Error 2
/root/robotpkg/mk/internal/trusted.mk:36: recipe for target 'install' failed
Cleaning up project directory and file based variables
ERROR: Job failed: exit code 1

failed
robotpkg-py-roscontrol-sot-ferrum Test
| See also "/root/robotpkg/wip/py-roscontrol-sot/work/roscontrol_sot-0.6.0/CMakeFiles/CMakeError.log".
For details or bug reports, check the complete log file in:
/root/robotpkg/wip/py-roscontrol-sot/work/configure.log
/root/robotpkg/mk/configure/cmake-configure.mk:100: recipe for target 'do-configure-cmake' failed
make: *** [do-configure-cmake] Error 1
make: *** [install] Error 2
/root/robotpkg/mk/internal/trusted.mk:36: recipe for target 'install' failed
Cleaning up project directory and file based variables
ERROR: Job failed: exit code 1

failed
doc-coverage Test
------------------------------------------------------------------------------
File Lines Exec Cover Missing
------------------------------------------------------------------------------
------------------------------------------------------------------------------
TOTAL 0 0 --%
------------------------------------------------------------------------------
$ gcovr -e CMakeFiles -e _deps -r . --html --html-details -o ${CI_PROJECT_DIR}/coverage/index.html
Cleaning up project directory and file based variables
ERROR: Job failed: exit code 1

failed
robotpkg-py-roscontrol-sot-buster Test
| See also "/root/robotpkg/wip/py-roscontrol-sot/work/roscontrol_sot-0.6.0/CMakeFiles/CMakeOutput.log".
| See also "/root/robotpkg/wip/py-roscontrol-sot/work/roscontrol_sot-0.6.0/CMakeFiles/CMakeError.log".

For details or bug reports, check the complete log file in:
/root/robotpkg/wip/py-roscontrol-sot/work/configure.log
make: *** [/root/robotpkg/mk/configure/cmake-configure.mk:100: do-configure-cmake] Error 1
make: *** [/root/robotpkg/mk/internal/trusted.mk:36: install] Error 2
Cleaning up project directory and file based variables
ERROR: Job failed: exit code 1

failed
format Test
+                  DataOneIter.controls[j] = (double)(i + j);
}
RcSotLog.record(DataOneIter);
}
++ git diff --ignore-submodules
++ wc -l
+ exit 226
Cleaning up project directory and file based variables
ERROR: Job failed: exit code 1