Merge branch 'devel' into noetic-devel

6 jobs for pr/28 in 1 minute and 11 seconds (queued for 2 seconds)
Name Stage Failure
failed
robotpkg-py-roscontrol-sot-18.04 Test
Total Test time (real) =   0.03 sec

The following tests FAILED:
1 - py-test-log (Failed)
Errors while running CTest
Makefile:132: recipe for target 'test' failed
make: *** [test] Error 8
Cleaning up project directory and file based variables
ERROR: Job failed: exit code 1

failed
robotpkg-py-roscontrol-sot-ferrum Test
Total Test time (real) =   0.03 sec

The following tests FAILED:
1 - py-test-log (Failed)
Errors while running CTest
Makefile:105: recipe for target 'test' failed
make: *** [test] Error 8
Cleaning up project directory and file based variables
ERROR: Job failed: exit code 1

failed
robotpkg-py-roscontrol-sot-buster Test

Total Test time (real) = 0.02 sec

The following tests FAILED:
1 - py-test-log (Failed)
Errors while running CTest
make: *** [Makefile:133: test] Error 8
Cleaning up project directory and file based variables
ERROR: Job failed: exit code 1

failed
format Test
   RcSotLog.save(filename);
-
-
}
++ git diff --ignore-submodules
++ wc -l
+ exit 237
Cleaning up project directory and file based variables
ERROR: Job failed: exit code 1