ros: update version

13 jobs for v2.2.3 in 236 minutes and 37 seconds (queued for 4 seconds)
latest
Status Name Job ID Coverage
  Test
passed doc-coverage #59654

03:56:35

97.0%
failed robotpkg-pinocchio-16.04-debug #59643

01:17:04

failed robotpkg-pinocchio-16.04-release #59642

00:55:27

passed robotpkg-pinocchio-18.04-debug #59645

01:35:37

passed robotpkg-pinocchio-18.04-release #59644

01:13:03

failed robotpkg-py-pinocchio-16.04-debug #59648

00:57:15

failed robotpkg-py-pinocchio-16.04-release #59646

00:57:22

passed robotpkg-py-pinocchio-18.04-debug #59652

03:04:32

passed robotpkg-py-pinocchio-18.04-release #59651

02:35:50

failed robotpkg-py-pinocchio-py3-16.04-debug #59649

00:56:45

failed robotpkg-py-pinocchio-py3-16.04-release #59647

00:57:02

passed robotpkg-py-pinocchio-py3-18.04-debug #59653

03:04:38

passed robotpkg-py-pinocchio-py3-18.04-release #59650

02:36:09

 
Name Stage Failure
failed
robotpkg-pinocchio-16.04-debug Test
| make: *** [all] Error 2
For details or bug reports, check the complete log file in:
/root/robotpkg/math/pinocchio/work.runner-7gqkM7SY-project-5-concurrent-16/build.log

make: *** [do-build] Error 2
/root/robotpkg/mk/build/build.mk:198: recipe for target 'do-build' failed
make: *** [install] Error 2
/root/robotpkg/mk/internal/trusted.mk:36: recipe for target 'install' failed
ERROR: Job failed: exit code 1
failed
robotpkg-py-pinocchio-16.04-release Test
/root/robotpkg/math/pinocchio/work.runner-7gqkM7SY-project-5-concurrent-19/build.log

make[1]: *** [do-build] Error 2
/root/robotpkg/mk/build/build.mk:198: recipe for target 'do-build' failed
make: *** [do-depends] Error 1
/root/robotpkg/mk/depends/depends.mk:70: recipe for target 'do-depends' failed
make: *** [install] Error 2
/root/robotpkg/mk/internal/trusted.mk:36: recipe for target 'install' failed
ERROR: Job failed: exit code 1
failed
robotpkg-py-pinocchio-16.04-debug Test
For details or bug reports, check the complete log file in:
/root/robotpkg/math/pinocchio/work.runner-7gqkM7SY-project-5-concurrent-21/build.log
make[1]: *** [do-build] Error 2
/root/robotpkg/mk/build/build.mk:198: recipe for target 'do-build' failed
/root/robotpkg/mk/depends/depends.mk:70: recipe for target 'do-depends' failed
make: *** [do-depends] Error 1
/root/robotpkg/mk/internal/trusted.mk:36: recipe for target 'install' failed
make: *** [install] Error 2
ERROR: Job failed: exit code 1
failed
robotpkg-py-pinocchio-py3-16.04-release Test
For details or bug reports, check the complete log file in:
/root/robotpkg/math/pinocchio/work.runner-7gqkM7SY-project-5-concurrent-20/build.log
make[1]: *** [do-build] Error 2
/root/robotpkg/mk/build/build.mk:198: recipe for target 'do-build' failed
/root/robotpkg/mk/depends/depends.mk:70: recipe for target 'do-depends' failed
make: *** [do-depends] Error 1
/root/robotpkg/mk/internal/trusted.mk:36: recipe for target 'install' failed
make: *** [install] Error 2
ERROR: Job failed: exit code 1
failed
robotpkg-py-pinocchio-py3-16.04-debug Test
For details or bug reports, check the complete log file in:
/root/robotpkg/math/pinocchio/work.runner-7gqkM7SY-project-5-concurrent-22/build.log
/root/robotpkg/mk/build/build.mk:198: recipe for target 'do-build' failed
make[1]: *** [do-build] Error 2
make: *** [do-depends] Error 1
/root/robotpkg/mk/depends/depends.mk:70: recipe for target 'do-depends' failed
/root/robotpkg/mk/internal/trusted.mk:36: recipe for target 'install' failed
make: *** [install] Error 2
ERROR: Job failed: exit code 1
failed
robotpkg-pinocchio-16.04-release Test
| make: *** [all] Error 2

For details or bug reports, check the complete log file in:
/root/robotpkg/math/pinocchio/work.runner-7gqkM7SY-project-5-concurrent-15/build.log
/root/robotpkg/mk/build/build.mk:198: recipe for target 'do-build' failed
make: *** [do-build] Error 2
make: *** [install] Error 2
/root/robotpkg/mk/internal/trusted.mk:36: recipe for target 'install' failed
ERROR: Job failed: exit code 1