Merge pull request #1658 from stack-of-tasks/pre-commit-ci-update-config

[pre-commit.ci] pre-commit autoupdate
12 jobs for devel in 14 minutes and 2 seconds (queued for 2 seconds)
Name Stage Failure
failed
robotpkg-py-pinocchio-16.04 Test
ERROR:
ERROR: See /root/robotpkg/math/pinocchio/work/sysdep.log for details.
ERROR: ======================================================================
make: *** [do-bootstrap-depends] Error 1
/root/robotpkg/mk/depends/bootstrap.mk:44: recipe for target 'do-bootstrap-depends' failed
make: *** [checkout] Error 2
/root/robotpkg/mk/internal/trusted.mk:40: recipe for target 'checkout' failed
Cleaning up project directory and file based variables
ERROR: Job failed: exit code 1

failed
robotpkg-pinocchio-16.04 Test

For details or bug reports, check the complete log file in:
/root/robotpkg/math/pinocchio/work/build.log
make: *** [do-build-make(/root/robotpkg/math/pinocchio/work/pinocchio-2.6.5)] Error 2
/root/robotpkg/mk/build/build.mk:204: recipe for target 'do-build-make(/root/robotpkg/math/pinocchio/work/pinocchio-2.6.5)' failed
/root/robotpkg/mk/internal/trusted.mk:40: recipe for target 'install' failed
make: *** [install] Error 2
Cleaning up project directory and file based variables
ERROR: Job failed: exit code 1

failed
format Test
./bindings/python/pinocchio/visualize/panda3d_visualizer.py:122:1: E305 expected 2 blank lines after class or function definition, found 1
./models/simple_model.py:7:1: E402 module level import not at top of file
./models/simple_model.py:8:1: E402 module level import not at top of file
./models/simple_model.py:79:72: E231 missing whitespace after ','
./models/simple_model.py:100:9: E722 do not use bare 'except'
./models/simple_model.py:109:52: E231 missing whitespace after ','
./models/simple_model.py:140:1: E305 expected 2 blank lines after class or function definition, found 1
Cleaning up project directory and file based variables
ERROR: Job failed: exit code 1