[pre-commit.ci] pre-commit autoupdate

updates:
- [github.com/pre-commit/pre-commit-hooks: v4.1.0 → v4.2.0](https://github.com/pre-commit/pre-commit-hooks/compare/v4.1.0...v4.2.0)
12 jobs for pre-commit-ci-update-config in 25 minutes and 26 seconds (queued for 5 seconds)
Name Stage Failure
failed
robotpkg-pinocchio-16.04 Test

For details or bug reports, check the complete log file in:
/root/robotpkg/math/pinocchio/work/build.log
/root/robotpkg/mk/build/build.mk:204: recipe for target 'do-build-make(/root/robotpkg/math/pinocchio/work/pinocchio-2.6.5)' failed
make: *** [do-build-make(/root/robotpkg/math/pinocchio/work/pinocchio-2.6.5)] Error 2
/root/robotpkg/mk/internal/trusted.mk:40: recipe for target 'install' failed
make: *** [install] Error 2
Cleaning up project directory and file based variables
ERROR: Job failed: exit code 1

failed
robotpkg-py-pinocchio-16.04 Test
ERROR:
ERROR: See /root/robotpkg/math/pinocchio/work/sysdep.log for details.
ERROR: ======================================================================
make: *** [do-bootstrap-depends] Error 1
/root/robotpkg/mk/depends/bootstrap.mk:44: recipe for target 'do-bootstrap-depends' failed
/root/robotpkg/mk/internal/trusted.mk:40: recipe for target 'checkout' failed
make: *** [checkout] Error 2
Cleaning up project directory and file based variables
ERROR: Job failed: exit code 1

failed
format Test
./bindings/python/pinocchio/derivative/dcrba.py:451:13: E231 missing whitespace after ','
./bindings/python/pinocchio/derivative/dcrba.py:451:40: E231 missing whitespace after ','
./bindings/python/pinocchio/derivative/dcrba.py:451:51: E231 missing whitespace after ','
./bindings/python/pinocchio/derivative/dcrba.py:451:55: E231 missing whitespace after ','
./bindings/python/pinocchio/derivative/dcrba.py:451:58: E231 missing whitespace after ','
./bindings/python/pinocchio/derivative/dcrba.py:452:34: E231 missing whitespace after ','
./bindings/python/pinocchio/derivative/dcrba.py:455:1: W293 blank line contains whitespace
Cleaning up project directory and file based variables
ERROR: Job failed: exit code 1