Merge pull request #1588 from florent-lamiraux/devel

[multibody/geometry] Add method to remove an object.
13 jobs for devel in 249 minutes and 27 seconds (queued for 7 seconds)
Name Stage Failure
failed
robotpkg-py-pinocchio-16.04 Test
/root/robotpkg/math/pinocchio/work/build.log
/root/robotpkg/mk/build/build.mk:198: recipe for target 'do-build' failed
make[1]: *** [do-build] Error 2
make: *** [do-depends] Error 1
/root/robotpkg/mk/depends/depends.mk:70: recipe for target 'do-depends' failed
/root/robotpkg/mk/internal/trusted.mk:36: recipe for target 'install' failed
make: *** [install] Error 2
Cleaning up project directory and file based variables
ERROR: Job failed: exit code 1

failed
robotpkg-pinocchio-16.04 Test

For details or bug reports, check the complete log file in:
/root/robotpkg/math/pinocchio/work/build.log
/root/robotpkg/mk/build/build.mk:198: recipe for target 'do-build' failed
make: *** [do-build] Error 2
/root/robotpkg/mk/internal/trusted.mk:36: recipe for target 'install' failed
make: *** [install] Error 2
Cleaning up project directory and file based variables
ERROR: Job failed: exit code 1

failed
format Test
./bindings/python/pinocchio/derivative/dcrba.py:451:13: E231 missing whitespace after ','
./bindings/python/pinocchio/derivative/dcrba.py:451:40: E231 missing whitespace after ','
./bindings/python/pinocchio/derivative/dcrba.py:451:51: E231 missing whitespace after ','
./bindings/python/pinocchio/derivative/dcrba.py:451:55: E231 missing whitespace after ','
./bindings/python/pinocchio/derivative/dcrba.py:451:58: E231 missing whitespace after ','
./bindings/python/pinocchio/derivative/dcrba.py:452:34: E231 missing whitespace after ','
./bindings/python/pinocchio/derivative/dcrba.py:455:1: W293 blank line contains whitespace
Cleaning up project directory and file based variables
ERROR: Job failed: exit code 1

failed
robotpkg-py-pinocchio-buster Test
Executing "step_script" stage of the job script
Using docker image sha256:188e0064e0d99bb6257eb084198cbd63961bc0d8cdff12320a83c1043cbac413 for memmos.laas.fr:5000/stack-of-tasks/pinocchio/py-pinocchio:buster with digest memmos.laas.fr:5000/stack-of-tasks/pinocchio/py-pinocchio@sha256:405bf8690bf62db25e126267cbc12c11ad9bf33a6909c00bb7fc8c229485e4d0 ...
$ sccache -s
sccache: error: failed to get stats from server
sccache: caused by: Failed to send data to or receive data from server
sccache: caused by: Failed to read response header
sccache: caused by: failed to fill whole buffer
Cleaning up project directory and file based variables
ERROR: Job failed: exit code 1

failed
robotpkg-pinocchio-buster Test
Executing "step_script" stage of the job script
Using docker image sha256:b29bbe85bc6f0e9a12af6269ad9d47fa302894f591693d1f8e876da5cf89baa8 for memmos.laas.fr:5000/stack-of-tasks/pinocchio/pinocchio:buster with digest memmos.laas.fr:5000/stack-of-tasks/pinocchio/pinocchio@sha256:941d062e6ac135e50b194cef6bc692259868dd326f18d28966cb61686d6b0c8a ...
$ sccache -s
sccache: error: failed to get stats from server
sccache: caused by: Failed to send data to or receive data from server
sccache: caused by: Failed to read response header
sccache: caused by: failed to fill whole buffer
Cleaning up project directory and file based variables
ERROR: Job failed: exit code 1

failed
robotpkg-py-pinocchio-20.04 Test
Executing "step_script" stage of the job script
Using docker image sha256:e68c3e34c1e2d28a753a311a8c07cadef5ea07cbb0455a085d07b9874df43928 for memmos.laas.fr:5000/stack-of-tasks/pinocchio/py-pinocchio:20.04 with digest memmos.laas.fr:5000/stack-of-tasks/pinocchio/py-pinocchio@sha256:31ba6b9984b0f14553126df863e39dc9b8e2f8fb5363b86f2b8997842f6b6a18 ...
$ sccache -s
sccache: error: failed to get stats from server
sccache: caused by: Failed to send data to or receive data from server
sccache: caused by: Failed to read response header
sccache: caused by: failed to fill whole buffer
Cleaning up project directory and file based variables
ERROR: Job failed: exit code 1