Merge pull request #1554 from fbailly/patch-1

Update README.md
12 jobs for master in 29 minutes and 1 second (queued for 6 seconds)
Name Stage Failure
failed
robotpkg-py-pinocchio-16.04 Test
For details or bug reports, check the complete log file in:
/root/robotpkg/math/py-pinocchio/work/extract.log

/root/robotpkg/mk/extract/checkout.mk:225: recipe for target 'do-checkout' failed
make: *** [do-checkout] Error 128
/root/robotpkg/mk/internal/trusted.mk:36: recipe for target 'checkout' failed
make: *** [checkout] Error 2
Cleaning up project directory and file based variables
ERROR: Job failed: exit code 1

failed
robotpkg-pinocchio-16.04 Test

For details or bug reports, check the complete log file in:
/root/robotpkg/math/pinocchio/work/build.log
/root/robotpkg/mk/build/build.mk:198: recipe for target 'do-build' failed
make: *** [do-build] Error 2
make: *** [install] Error 2
/root/robotpkg/mk/internal/trusted.mk:36: recipe for target 'install' failed
Cleaning up project directory and file based variables
ERROR: Job failed: exit code 1

failed
format Test
./unittest/python/pybind11/test-cpp2pybind11.py:1:20: E401 multiple imports on one line
./unittest/python/pybind11/test-cpp2pybind11.py:7:35: E231 missing whitespace after ','
./unittest/python/pybind11/test-cpp2pybind11.py:10:1: E265 block comment should start with '# '
./unittest/python/pybind11/test-cpp2pybind11.py:12:1: E302 expected 2 blank lines, found 1
./unittest/python/pybind11/test-cpp2pybind11.py:12:22: E231 missing whitespace after ','
./unittest/python/pybind11/test-cpp2pybind11.py:16:5: E265 block comment should start with '# '
./unittest/python/pybind11/test-cpp2pybind11.py:20:1: E305 expected 2 blank lines after class or function definition, found 1
Cleaning up project directory and file based variables
ERROR: Job failed: exit code 1