cmake: restore definitions

10 jobs for master in 172 minutes and 55 seconds (queued for 8 seconds)
Status Name Job ID Coverage
  Test
passed doc-coverage #120737

02:42:38

97.0%
failed format #120738
allowed to fail

00:00:39

passed robotpkg-pinocchio-18.04-release #120729

00:26:56

passed robotpkg-py-pinocchio-py2-18.04-release #120732

01:11:30

passed robotpkg-py-pinocchio-py3-16.04-release #120730

01:29:03

passed robotpkg-py-pinocchio-py3-18.04-release #120731

01:29:26

passed robotpkg-py-pinocchio-py3-20.04-release #120733

02:52:54

passed robotpkg-py-pinocchio-py3-buster-release #120734

01:31:50

failed robotpkg-py-pinocchio-py3-ferrum-release #120735
allowed to fail

00:01:51

passed robotpkg-py-pinocchio-py3-stretch-release #120736

01:18:19

 
Name Stage Failure
failed
format Test
     case pinocchio::URDF:
#ifdef PINOCCHIO_WITH_URDFDOM
- pinocchio::urdf::buildModel(filename,model,verbose);
+ pinocchio::urdf::buildModel(filename, model, verbose);
#else
std::cerr << "It seems that the URDFDOM module has not been found during the Cmake process." << std::endl;
#endif
Cleaning up file based variables
ERROR: Job failed: exit code 1
failed
robotpkg-py-pinocchio-py3-ferrum-release Test
/root/robotpkg/math/pinocchio/work.runner-zuwchyoo-project-5-concurrent-1/build.log
/root/robotpkg/mk/build/build.mk:198: recipe for target 'do-build' failed
make[1]: *** [do-build] Error 2
/root/robotpkg/mk/depends/depends.mk:70: recipe for target 'do-depends' failed
make: *** [do-depends] Error 1
/root/robotpkg/mk/internal/trusted.mk:36: recipe for target 'install' failed
make: *** [install] Error 2
Cleaning up file based variables
ERROR: Job failed: exit code 1