cmake: sync submodule

10 jobs for master in 246 minutes and 43 seconds (queued for 3 seconds)
Status Name Job ID Coverage
  Test
passed doc-coverage #120686

04:06:40

97.0%
failed format #120687
allowed to fail

00:00:51

passed robotpkg-pinocchio-18.04-release #120678

00:00:47

passed robotpkg-py-pinocchio-py2-18.04-release #120681

00:51:41

passed robotpkg-py-pinocchio-py3-16.04-release #120679

01:03:37

passed robotpkg-py-pinocchio-py3-18.04-release #120680

01:37:21

passed robotpkg-py-pinocchio-py3-20.04-release #120682

01:18:03

passed robotpkg-py-pinocchio-py3-buster-release #120683

01:26:07

failed robotpkg-py-pinocchio-py3-ferrum-release #120684
allowed to fail

00:04:40

passed robotpkg-py-pinocchio-py3-stretch-release #120685

01:06:34

 
Name Stage Failure
failed
format Test
     case pinocchio::URDF:
#ifdef PINOCCHIO_WITH_URDFDOM
- pinocchio::urdf::buildModel(filename,model,verbose);
+ pinocchio::urdf::buildModel(filename, model, verbose);
#else
std::cerr << "It seems that the URDFDOM module has not been found during the Cmake process." << std::endl;
#endif
Cleaning up file based variables
ERROR: Job failed: exit code 1
failed
robotpkg-py-pinocchio-py3-ferrum-release Test
/root/robotpkg/math/pinocchio/work.runner-ke6dzkhd-project-5-concurrent-2/build.log
/root/robotpkg/mk/build/build.mk:198: recipe for target 'do-build' failed
make[1]: *** [do-build] Error 2
make: *** [do-depends] Error 1
/root/robotpkg/mk/depends/depends.mk:70: recipe for target 'do-depends' failed
make: *** [install] Error 2
/root/robotpkg/mk/internal/trusted.mk:36: recipe for target 'install' failed
Cleaning up file based variables
ERROR: Job failed: exit code 1