Merge pull request #1452 from jcarpent/topic/boost

Enforce BOOST_MPL_LIMIT_LIST_SIZE
10 jobs for devel in 144 minutes and 5 seconds (queued for 2 seconds)
Status Name Job ID Coverage
  Test
passed doc-coverage #119234

02:08:38

97.0%
failed format #119235
allowed to fail

00:00:40

passed robotpkg-pinocchio-18.04-release #119226

00:02:00

passed robotpkg-py-pinocchio-py2-18.04-release #119229

01:09:24

failed robotpkg-py-pinocchio-py3-16.04-release #119227
allowed to fail

00:03:33

passed robotpkg-py-pinocchio-py3-18.04-release #119228

00:15:00

passed robotpkg-py-pinocchio-py3-20.04-release #119230

01:25:26

passed robotpkg-py-pinocchio-py3-buster-release #119231

01:32:58

passed robotpkg-py-pinocchio-py3-ferrum-release #119232

02:24:03

passed robotpkg-py-pinocchio-py3-stretch-release #119233

00:01:23

 
Name Stage Failure
failed
robotpkg-py-pinocchio-py3-16.04-release Test
/root/robotpkg/math/pinocchio/work/build.log
/root/robotpkg/mk/build/build.mk:198: recipe for target 'do-build' failed
make[1]: *** [do-build] Error 2
make: *** [do-depends] Error 1
/root/robotpkg/mk/depends/depends.mk:70: recipe for target 'do-depends' failed
/root/robotpkg/mk/internal/trusted.mk:36: recipe for target 'install' failed
make: *** [install] Error 2
Cleaning up file based variables
ERROR: Job failed: exit code 1
failed
format Test
+///
+/// \param[in] quat The unit quaternion representing a certain rotation.
+///
+/// \return The angular velocity vector associated to the quaternion.
+///
+template <typename QuaternionLike>
+Eigen::Matrix<typename QuaternionLike::Scalar, 3, 1,
+ PINOCCHIO_EIGEN_PLAIN_TYPE(typename QuaternionLike::V
Job's log exceeded limit of 4194304 bytes.
Job execution will continue but no more output will be collected.