ci/conda: fix bug with cxx >= 12

10 jobs for pr/1452 in 148 minutes and 10 seconds (queued for 2 seconds)
Status Name Job ID Coverage
  Test
passed doc-coverage #119216

01:56:11

97.0%
failed format #119217
allowed to fail

00:00:18

passed robotpkg-pinocchio-18.04-release #119208

00:01:26

passed robotpkg-py-pinocchio-py2-18.04-release #119211

01:12:06

failed robotpkg-py-pinocchio-py3-16.04-release #119209
allowed to fail

00:04:15

passed robotpkg-py-pinocchio-py3-18.04-release #119210

01:39:50

passed robotpkg-py-pinocchio-py3-20.04-release #119212

01:24:31

passed robotpkg-py-pinocchio-py3-buster-release #119213

01:44:38

passed robotpkg-py-pinocchio-py3-ferrum-release #119214

02:28:09

passed robotpkg-py-pinocchio-py3-stretch-release #119215

01:18:41

 
Name Stage Failure
failed
robotpkg-py-pinocchio-py3-16.04-release Test
/root/robotpkg/math/pinocchio/work/build.log
/root/robotpkg/mk/build/build.mk:198: recipe for target 'do-build' failed
make[1]: *** [do-build] Error 2
/root/robotpkg/mk/depends/depends.mk:70: recipe for target 'do-depends' failed
make: *** [do-depends] Error 1
/root/robotpkg/mk/internal/trusted.mk:36: recipe for target 'install' failed
make: *** [install] Error 2
Cleaning up file based variables
ERROR: Job failed: exit code 1
failed
format Test
     case pinocchio::URDF:
#ifdef PINOCCHIO_WITH_URDFDOM
- pinocchio::urdf::buildModel(filename,model,verbose);
+ pinocchio::urdf::buildModel(filename, model, verbose);
#else
std::cerr << "It seems that the URDFDOM module has not been found during the Cmake process." << std::endl;
#endif
Cleaning up file based variables
ERROR: Job failed: exit code 1