python: fix include order

10 jobs for pr/1452 in 147 minutes and 31 seconds (queued for 3 seconds)
Status Name Job ID Coverage
  Test
passed doc-coverage #119177

01:49:31

97.0%
failed format #119178
allowed to fail

00:00:29

passed robotpkg-pinocchio-18.04-release #119169

00:31:53

passed robotpkg-py-pinocchio-py2-18.04-release #119172

02:27:29

failed robotpkg-py-pinocchio-py3-16.04-release #119170
allowed to fail

00:05:08

passed robotpkg-py-pinocchio-py3-18.04-release #119171

01:34:39

passed robotpkg-py-pinocchio-py3-20.04-release #119173

01:22:32

passed robotpkg-py-pinocchio-py3-buster-release #119174

01:11:47

passed robotpkg-py-pinocchio-py3-ferrum-release #119175

01:34:22

passed robotpkg-py-pinocchio-py3-stretch-release #119176

01:11:44

 
Name Stage Failure
failed
robotpkg-py-pinocchio-py3-16.04-release Test
/root/robotpkg/math/pinocchio/work/build.log
/root/robotpkg/mk/build/build.mk:198: recipe for target 'do-build' failed
make[1]: *** [do-build] Error 2
/root/robotpkg/mk/depends/depends.mk:70: recipe for target 'do-depends' failed
make: *** [do-depends] Error 1
/root/robotpkg/mk/internal/trusted.mk:36: recipe for target 'install' failed
make: *** [install] Error 2
Cleaning up file based variables
ERROR: Job failed: exit code 1
failed
format Test
+///
+/// \param[in] quat The unit quaternion representing a certain rotation.
+///
+/// \return The angular velocity vector associated to the quaternion.
+///
+template <typename QuaternionLike>
+Eigen::Matrix<typename QuaternionLike::Scalar, 3, 1,
+ PINOCCHIO_EIGEN_PLAIN_TYPE(typename QuaternionLike::Vec
Job's log exceeded limit of 4194304 bytes.
Job execution will continue but no more output will be collected.