test/algo: enforce testing of empty joint list for buildReducedModel

9 jobs for pr/1442 in 121 minutes and 46 seconds (queued for 11 seconds)
Name Stage Failure
failed
robotpkg-py-pinocchio-py3-16.04-release Test

make[1]: *** [do-build] Error 2
/root/robotpkg/mk/build/build.mk:198: recipe for target 'do-build' failed
/root/robotpkg/mk/depends/depends.mk:70: recipe for target 'do-depends' failed
make: *** [do-depends] Error 1
/root/robotpkg/mk/internal/trusted.mk:36: recipe for target 'install' failed
make: *** [install] Error 2
Cleaning up file based variables
ERROR: Job failed: exit code 1
failed
format Test
     case pinocchio::URDF:
#ifdef PINOCCHIO_WITH_URDFDOM
- pinocchio::urdf::buildModel(filename,model,verbose);
+ pinocchio::urdf::buildModel(filename, model, verbose);
#else
std::cerr << "It seems that the URDFDOM module has not been found during the Cmake process." << std::endl;
#endif
Cleaning up file based variables
ERROR: Job failed: exit code 1