Merge pull request #1429 from jcarpent/topic/ci

Add Mac OS X ci
9 jobs for devel in 241 minutes and 49 seconds (queued for 2 seconds)
Name Stage Failure
failed
robotpkg-py-pinocchio-py3-16.04-release Test
/root/robotpkg/math/pinocchio/work/build.log
/root/robotpkg/mk/build/build.mk:198: recipe for target 'do-build' failed
make[1]: *** [do-build] Error 2
/root/robotpkg/mk/depends/depends.mk:70: recipe for target 'do-depends' failed
make: *** [do-depends] Error 1
/root/robotpkg/mk/internal/trusted.mk:36: recipe for target 'install' failed
make: *** [install] Error 2
Cleaning up file based variables
ERROR: Job failed: exit code 1
failed
format Test
-
- switch(op)
- {
- case SETTO:
- Jout.diagonal().setConstant(a);
- Jout(0,1) = -b*r[2]; Jout(1,0) = -Jout(0,1);
- Jout(0,2) = b*r[1]; Jout(2,0) = -Jout(0,2);
- Jout(1,2) = -
Job's log exceeded limit of 4194304 bytes.
Job execution will continue but no more output will be collected.