ros: update version

9 jobs for master in 104 minutes and 57 seconds (queued for 1 second)
Status Name Job ID Coverage
  Test
passed doc-coverage #114261

01:44:55

97.0%
failed format #114262
allowed to fail

00:04:23

passed robotpkg-pinocchio-18.04-release #114254

00:07:22

passed robotpkg-py-pinocchio-py2-18.04-release #114257

01:13:46

failed robotpkg-py-pinocchio-py3-16.04-release #114255
allowed to fail

00:03:18

passed robotpkg-py-pinocchio-py3-18.04-release #114256

01:03:36

passed robotpkg-py-pinocchio-py3-20.04-release #114258

00:07:46

passed robotpkg-py-pinocchio-py3-buster-release #114259

00:16:37

passed robotpkg-py-pinocchio-py3-stretch-release #114260

01:41:33

 
Name Stage Failure
failed
robotpkg-py-pinocchio-py3-16.04-release Test
/root/robotpkg/math/pinocchio/work/build.log
make[1]: *** [do-build] Error 2
/root/robotpkg/mk/build/build.mk:198: recipe for target 'do-build' failed
/root/robotpkg/mk/depends/depends.mk:70: recipe for target 'do-depends' failed
make: *** [do-depends] Error 1
make: *** [install] Error 2
/root/robotpkg/mk/internal/trusted.mk:36: recipe for target 'install' failed
Cleaning up file based variables
ERROR: Job failed: exit code 1
failed
format Test
     case pinocchio::URDF:
#ifdef PINOCCHIO_WITH_URDFDOM
- pinocchio::urdf::buildModel(filename,model,verbose);
+ pinocchio::urdf::buildModel(filename, model, verbose);
#else
std::cerr << "It seems that the URDFDOM module has not been found during the Cmake process." << std::endl;
#endif
Cleaning up file based variables
ERROR: Job failed: exit code 1