Merge pull request #1342 from jcarpent/topic/urdf

Fix var name in CMake
9 jobs for devel in 141 minutes and 42 seconds (queued for 1 second)
Name Stage Failure
failed
robotpkg-py-pinocchio-py3-16.04-release Test
/root/robotpkg/math/pinocchio/work.runner-swwlejyc-project-5-concurrent-0/build.log
/root/robotpkg/mk/build/build.mk:198: recipe for target 'do-build' failed
make[1]: *** [do-build] Error 2
make: *** [do-depends] Error 1
/root/robotpkg/mk/depends/depends.mk:70: recipe for target 'do-depends' failed
make: *** [install] Error 2
/root/robotpkg/mk/internal/trusted.mk:36: recipe for target 'install' failed
Cleaning up file based variables
ERROR: Job failed: exit code 1
failed
format Test
-    { m_data += v.toVector(); return *this; }
-
- template<int O2>
- MotionTpl & __mequ__(const MotionTpl<Scalar,O2> & v)
- { m_data -= v.toVector(); return *this; }
-
- template<typename Vector6ArgType>
- MotionTpl & __mequ__(const MotionRef<Vector6ArgType> & v)
- { m_data -= v.toVector(); return *this
Job's log exceeded limit of 4194304 bytes.