release: Update package.xml version to 2.7.5

7 jobs for devel in 20 minutes and 47 seconds (queued for 4 seconds)
Name Stage Failure
failed
robotpkg-py-eigenpy-16.04 Test

For details or bug reports, check the complete log file in:
/root/robotpkg/math/py-eigenpy/work/build.log
/root/robotpkg/mk/build/build.mk:204: recipe for target 'do-build-make(/root/robotpkg/math/py-eigenpy/work/eigenpy-2.6.11)' failed
make: *** [do-build-make(/root/robotpkg/math/py-eigenpy/work/eigenpy-2.6.11)] Error 2
/root/robotpkg/mk/internal/trusted.mk:40: recipe for target 'install' failed
make: *** [install] Error 2
Cleaning up project directory and file based variables
ERROR: Job failed: exit code 1

failed
robotpkg-py-eigenpy-ferrum Test
Total Test time (real) =   0.42 sec

The following tests FAILED:
21 - py-MINRES (Failed)
Errors while running CTest
make: *** [test] Error 8
Makefile:128: recipe for target 'test' failed
Cleaning up project directory and file based variables
ERROR: Job failed: exit code 1

failed
format Test
./unittest/python/test_MINRES.py:4:1: F401 'numpy.linalg as la' imported but unused
./benchmarks/bench-switch.py:6:1: F401 'time' imported but unused
./benchmarks/bench-switch.py:7:1: F401 'timeit' imported but unused
./python/eigenpy/__init__.py:5:1: F403 'from .eigenpy_pywrap import *' used; unable to detect undefined names
./python/eigenpy/__init__.py:5:1: F401 '.eigenpy_pywrap.*' imported but unused
./python/eigenpy/__init__.py:6:1: F401 '.eigenpy_pywrap.__version__' imported but unused
./python/eigenpy/__init__.py:6:1: F401 '.eigenpy_pywrap.__raw_version__' imported but unused
Cleaning up project directory and file based variables
ERROR: Job failed: exit code 1