Merge pull request #284 from ManifoldFR/devel

Fix for Refs to dynamic (1, N) blocks
7 jobs for devel in 6 minutes and 7 seconds (queued for 3 seconds)
Name Stage Failure
failed
robotpkg-py-eigenpy-16.04 Test

For details or bug reports, check the complete log file in:
/root/robotpkg/math/py-eigenpy/work/build.log
make: *** [do-build] Error 2
/root/robotpkg/mk/build/build.mk:198: recipe for target 'do-build' failed
make: *** [install] Error 2
/root/robotpkg/mk/internal/trusted.mk:36: recipe for target 'install' failed
Cleaning up project directory and file based variables
ERROR: Job failed: exit code 1

failed
robotpkg-py-eigenpy-ferrum Test
Total Test time (real) =   0.26 sec

The following tests FAILED:
21 - py-MINRES (Failed)
Errors while running CTest
Makefile:128: recipe for target 'test' failed
make: *** [test] Error 8
Cleaning up project directory and file based variables
ERROR: Job failed: exit code 1

failed
format Test
./unittest/python/test_complex.py:4:1: F403 'from complex import *' used; unable to detect undefined names
./unittest/python/test_complex.py:6:1: F405 'switchToNumpyArray' may be undefined, or defined from star imports: complex
./unittest/python/test_complex.py:17:14: F405 'real' may be undefined, or defined from star imports: complex
./unittest/python/test_complex.py:19:14: F405 'imag' may be undefined, or defined from star imports: complex
./unittest/python/test_complex.py:23:17: F405 'ascomplex' may be undefined, or defined from star imports: complex
./benchmarks/bench-switch.py:6:1: F401 'time' imported but unused
./benchmarks/bench-switch.py:7:1: F401 'timeit' imported but unused
Cleaning up project directory and file based variables
ERROR: Job failed: exit code 1