[cmake] Synchronize

14 jobs for devel in 6 minutes and 44 seconds (queued for 2 seconds)
Name Stage Failure
failed
robotpkg-py-dynamic-graph-v3-py3-18.04-debug Test
| make: *** [all] Error 2

For details or bug reports, check the complete log file in:
/root/robotpkg/wip/py-dynamic-graph-v3/work.runner-7gqkM7SY-project-167-concurrent-3/build.log
make: *** [do-build] Error 2
/root/robotpkg/mk/build/build.mk:198: recipe for target 'do-build' failed
make: *** [install] Error 2
/root/robotpkg/mk/internal/trusted.mk:36: recipe for target 'install' failed
ERROR: Job failed: exit code 1
failed
doc-coverage Test
include/dynamic-graph/python/link-to-python.hh
1 0 0% 12
src/dynamic_graph/python-compat.cc 11 0 0% 4-5,13-19,21-22
src/interpreter.cc 113 0 0% 9,14,29,31,33-34,36-41,47,49,51,53,57,60,64,66-81,84,87-88,95-96,99-100,103-104,107,109,112,115-116,119-120,124-127,130-133,136,138,140,142,144-145,147,150,152,155,158,163-166,168-169,173-174,176,183,185,188,190-192,195-199,202,204-208,210,212-213,216-217,222-223,225,228,230-232,239-241,243,247
------------------------------------------------------------------------------
TOTAL 136 0 0%
------------------------------------------------------------------------------
$ gcovr -r . --html --html-details -o ${CI_PROJECT_DIR}/coverage/index.html
ERROR: Job failed: exit code 1
failed
robotpkg-py-dynamic-graph-v3-py3-18.04-release Test
| make: *** [all] Error 2

For details or bug reports, check the complete log file in:
/root/robotpkg/wip/py-dynamic-graph-v3/work.runner-7gqkM7SY-project-167-concurrent-1/build.log
make: *** [do-build] Error 2
/root/robotpkg/mk/build/build.mk:198: recipe for target 'do-build' failed
/root/robotpkg/mk/internal/trusted.mk:36: recipe for target 'install' failed
make: *** [install] Error 2
ERROR: Job failed: exit code 1
failed
robotpkg-py-dynamic-graph-v3-py3-16.04-release Test
| make: *** [all] Error 2

For details or bug reports, check the complete log file in:
/root/robotpkg/wip/py-dynamic-graph-v3/work.runner-sWwLEjyc-project-167-concurrent-0/build.log
make: *** [do-build] Error 2
/root/robotpkg/mk/build/build.mk:198: recipe for target 'do-build' failed
/root/robotpkg/mk/internal/trusted.mk:36: recipe for target 'install' failed
make: *** [install] Error 2
ERROR: Job failed: exit code 1
failed
format Test
 
- void act() {
- m_sigdSIN.accessCopy();
- }
+ void act() { m_sigdSIN.accessCopy(); }
};
DYNAMICGRAPH_FACTORY_ENTITY_PLUGIN(CustomEntity, "CustomEntity");
} // namespace dynamicgraph
ERROR: Job failed: exit code 1
failed
robotpkg-py-dynamic-graph-v3-18.04-release Test
| make: *** [all] Error 2

For details or bug reports, check the complete log file in:
/root/robotpkg/wip/py-dynamic-graph-v3/work.runner-7gqkM7SY-project-167-concurrent-2/build.log
make: *** [do-build] Error 2
/root/robotpkg/mk/build/build.mk:198: recipe for target 'do-build' failed
make: *** [install] Error 2
/root/robotpkg/mk/internal/trusted.mk:36: recipe for target 'install' failed
ERROR: Job failed: exit code 1
failed
robotpkg-py-dynamic-graph-v3-stretch-debug Test
| make: *** [all] Error 2

For details or bug reports, check the complete log file in:
/root/robotpkg/wip/py-dynamic-graph-v3/work.runner-7gqkM7SY-project-167-concurrent-6/build.log
/root/robotpkg/mk/build/build.mk:198: recipe for target 'do-build' failed
make: *** [do-build] Error 2
/root/robotpkg/mk/internal/trusted.mk:36: recipe for target 'install' failed
make: *** [install] Error 2
ERROR: Job failed: exit code 1
failed
robotpkg-py-dynamic-graph-v3-stretch-release Test
| make: *** [all] Error 2

For details or bug reports, check the complete log file in:
/root/robotpkg/wip/py-dynamic-graph-v3/work.runner-7gqkM7SY-project-167-concurrent-5/build.log
make: *** [do-build] Error 2
/root/robotpkg/mk/build/build.mk:198: recipe for target 'do-build' failed
make: *** [install] Error 2
/root/robotpkg/mk/internal/trusted.mk:36: recipe for target 'install' failed
ERROR: Job failed: exit code 1
failed
robotpkg-py-dynamic-graph-v3-py3-stretch-release Test
| make: *** [all] Error 2

For details or bug reports, check the complete log file in:
/root/robotpkg/wip/py-dynamic-graph-v3/work.runner-7gqkM7SY-project-167-concurrent-4/build.log
/root/robotpkg/mk/build/build.mk:198: recipe for target 'do-build' failed
make: *** [do-build] Error 2
make: *** [install] Error 2
/root/robotpkg/mk/internal/trusted.mk:36: recipe for target 'install' failed
ERROR: Job failed: exit code 1
failed
robotpkg-py-dynamic-graph-v3-py3-stretch-debug Test
| make: *** [all] Error 2

For details or bug reports, check the complete log file in:
/root/robotpkg/wip/py-dynamic-graph-v3/work.runner-7gqkM7SY-project-167-concurrent-7/build.log
/root/robotpkg/mk/build/build.mk:198: recipe for target 'do-build' failed
make: *** [do-build] Error 2
make: *** [install] Error 2
/root/robotpkg/mk/internal/trusted.mk:36: recipe for target 'install' failed
ERROR: Job failed: exit code 1
failed
robotpkg-py-dynamic-graph-v3-py3-16.04-debug Test
| make: *** [all] Error 2

For details or bug reports, check the complete log file in:
/root/robotpkg/wip/py-dynamic-graph-v3/work.runner-7gqkM7SY-project-167-concurrent-0/build.log
make: *** [do-build] Error 2
/root/robotpkg/mk/build/build.mk:198: recipe for target 'do-build' failed
make: *** [install] Error 2
/root/robotpkg/mk/internal/trusted.mk:36: recipe for target 'install' failed
ERROR: Job failed: exit code 1
failed
robotpkg-py-dynamic-graph-v3-18.04-debug Test
| make: *** [all] Error 2

For details or bug reports, check the complete log file in:
/root/robotpkg/wip/py-dynamic-graph-v3/work.runner-sWwLEjyc-project-167-concurrent-3/build.log
/root/robotpkg/mk/build/build.mk:198: recipe for target 'do-build' failed
make: *** [do-build] Error 2
/root/robotpkg/mk/internal/trusted.mk:36: recipe for target 'install' failed
make: *** [install] Error 2
ERROR: Job failed: exit code 1
failed
robotpkg-py-dynamic-graph-v3-16.04-release Test
| make: *** [all] Error 2

For details or bug reports, check the complete log file in:
/root/robotpkg/wip/py-dynamic-graph-v3/work.runner-sWwLEjyc-project-167-concurrent-1/build.log
/root/robotpkg/mk/build/build.mk:198: recipe for target 'do-build' failed
make: *** [do-build] Error 2
/root/robotpkg/mk/internal/trusted.mk:36: recipe for target 'install' failed
make: *** [install] Error 2
ERROR: Job failed: exit code 1
failed
robotpkg-py-dynamic-graph-v3-16.04-debug Test
| make: *** [all] Error 2
For details or bug reports, check the complete log file in:
/root/robotpkg/wip/py-dynamic-graph-v3/work.runner-sWwLEjyc-project-167-concurrent-2/build.log

/root/robotpkg/mk/build/build.mk:198: recipe for target 'do-build' failed
make: *** [do-build] Error 2
make: *** [install] Error 2
/root/robotpkg/mk/internal/trusted.mk:36: recipe for target 'install' failed
ERROR: Job failed: exit code 1