16.04

fix:
> include/dynamic-graph/python/dynamic-graph-py.hh::33:25: error: 'stl_input_iterator' is not a member of 'bp'

fix:
> include/dynamic-graph/python/module.hh:47:26: error: 'exposeEntity' function uses 'auto' type specifier without trailing return type

doesn't fix:
> src/dynamic-graph/dynamic-graph-py.cc:191:24: error: 'raw_function' is not a member of 'bp'
as this was added in Boost v1.60, and 16.04 has 1.58
8 jobs for topic/xenial in 9 minutes and 38 seconds (queued for 2 seconds)
latest
Status Job ID Name Coverage
  Test
passed doc-coverage #90150

00:04:15

65.0%
failed format #90151
allowed to fail

00:00:09

passed robotpkg-py-dynamic-graph-v3-py2-18.04-release #90146

00:08:47

failed robotpkg-py-dynamic-graph-v3-py3-16.04-release #90144
allowed to fail

00:04:55

passed robotpkg-py-dynamic-graph-v3-py3-18.04-release #90145

00:03:31

passed robotpkg-py-dynamic-graph-v3-py3-20.04-release #90147

00:05:31

passed robotpkg-py-dynamic-graph-v3-py3-buster-release #90148

00:03:35

passed robotpkg-py-dynamic-graph-v3-py3-stretch-release #90149

00:09:37

 
Name Stage Failure
failed
robotpkg-py-dynamic-graph-v3-py3-16.04-release Test
| Makefile:141: recipe for target 'all' failed

For details or bug reports, check the complete log file in:
/root/robotpkg/wip/py-dynamic-graph-v3/work.runner-5nsakv6-project-167-concurrent-0/build.log
make: *** [do-build] Error 2
/root/robotpkg/mk/build/build.mk:198: recipe for target 'do-build' failed
make: *** [install] Error 2
/root/robotpkg/mk/internal/trusted.mk:36: recipe for target 'install' failed
ERROR: Job failed: exit code 1
failed
format Test
$ check-clang-format.sh
$ flake8 .
./src/dynamic_graph/__init__.py:8:1: F401 'sys' imported but unused
./src/dynamic_graph/entity.py:8:1: F401 '.wrap.LoggerVerbosity as VerbosityLevel' imported but unused
./src/dynamic_graph/entity.py:9:1: F401 '.wrap.Entity' imported but unused
./src/dynamic_graph/signal_base.py:7:1: F401 '.wrap.SignalBase' imported but unused
./src/dynamic_graph/signal_base.py:7:1: F401 '.wrap.create_signal_wrapper as SignalWrapper' imported but unused
./src/dynamic_graph/signal_base.py:13:1: E302 expected 2 blank lines, found 1
ERROR: Job failed: exit code 1