v4.0.0

8 jobs for pr/62 in 7 minutes and 43 seconds (queued for 2 seconds)
Status Job ID Name Coverage
  Test
passed #90039
doc-coverage

00:03:15

65.0%
failed #90040
allowed to fail
format

00:00:27

passed #90035
robotpkg-py-dynamic-graph-v3-py2-18.04-release

00:03:18

failed #90033
allowed to fail
robotpkg-py-dynamic-graph-v3-py3-16.04-release

00:01:27

passed #90034
robotpkg-py-dynamic-graph-v3-py3-18.04-release

00:02:03

passed #90036
robotpkg-py-dynamic-graph-v3-py3-20.04-release

00:07:42

passed #90037
robotpkg-py-dynamic-graph-v3-py3-buster-release

00:03:19

passed #90038
robotpkg-py-dynamic-graph-v3-py3-stretch-release

00:04:24

 
Name Stage Failure
failed
robotpkg-py-dynamic-graph-v3-py3-16.04-release Test
| make: *** [all] Error 2

For details or bug reports, check the complete log file in:
/root/robotpkg/wip/py-dynamic-graph-v3/work.runner-ke6dzkhd-project-167-concurrent-0/build.log
/root/robotpkg/mk/build/build.mk:198: recipe for target 'do-build' failed
make: *** [do-build] Error 2
/root/robotpkg/mk/internal/trusted.mk:36: recipe for target 'install' failed
make: *** [install] Error 2
ERROR: Job failed: exit code 1
failed
format Test
$ check-clang-format.sh
$ flake8 .
./src/dynamic_graph/entity.py:8:1: F401 '.wrap.LoggerVerbosity as VerbosityLevel' imported but unused
./src/dynamic_graph/entity.py:9:1: F401 '.wrap.Entity' imported but unused
./src/dynamic_graph/__init__.py:8:1: F401 'sys' imported but unused
./src/dynamic_graph/signal_base.py:7:1: F401 '.wrap.SignalBase' imported but unused
./src/dynamic_graph/signal_base.py:7:1: F401 '.wrap.create_signal_wrapper as SignalWrapper' imported but unused
./src/dynamic_graph/signal_base.py:13:1: E302 expected 2 blank lines, found 1
ERROR: Job failed: exit code 1