v4.0.0

8 jobs for pr/62 in 3 minutes and 26 seconds (queued for 1 second)
Status Job ID Name Coverage
  Test
passed #89672
doc-coverage

00:00:48

65.0%
failed #89673
allowed to fail
format

00:00:37

passed #89668
robotpkg-py-dynamic-graph-v3-py2-18.04-release

00:03:25

failed #89666
allowed to fail
robotpkg-py-dynamic-graph-v3-py3-16.04-release

00:01:37

passed #89667
robotpkg-py-dynamic-graph-v3-py3-18.04-release

00:02:58

passed #89669
robotpkg-py-dynamic-graph-v3-py3-20.04-release

00:03:13

passed #89670
robotpkg-py-dynamic-graph-v3-py3-buster-release

00:00:41

passed #89671
robotpkg-py-dynamic-graph-v3-py3-stretch-release

00:03:17

 
Name Stage Failure
failed
robotpkg-py-dynamic-graph-v3-py3-16.04-release Test
| make: *** [all] Error 2
For details or bug reports, check the complete log file in:
/root/robotpkg/wip/py-dynamic-graph-v3/work.runner-ke6dzkhd-project-167-concurrent-0/build.log

make: *** [do-build] Error 2
/root/robotpkg/mk/build/build.mk:198: recipe for target 'do-build' failed
make: *** [install] Error 2
/root/robotpkg/mk/internal/trusted.mk:36: recipe for target 'install' failed
ERROR: Job failed: exit code 1
failed
format Test
$ check-clang-format.sh
$ flake8 .
./src/dynamic_graph/entity.py:8:1: F401 '.wrap.LoggerVerbosity as VerbosityLevel' imported but unused
./src/dynamic_graph/entity.py:9:1: F401 '.wrap.Entity' imported but unused
./src/dynamic_graph/signal_base.py:7:1: F401 '.wrap.SignalBase' imported but unused
./src/dynamic_graph/signal_base.py:7:1: F401 '.wrap.create_signal_wrapper as SignalWrapper' imported but unused
./src/dynamic_graph/signal_base.py:13:1: E302 expected 2 blank lines, found 1
./src/dynamic_graph/__init__.py:8:1: F401 'sys' imported but unused
ERROR: Job failed: exit code 1