v3.6.0

8 jobs for pr/62 in 4 minutes and 23 seconds (queued for 3 seconds)
Status Job ID Name Coverage
  Test
passed #89529
doc-coverage

00:03:59

65.0%
failed #89530
allowed to fail
format

00:00:11

passed #89520
robotpkg-py-dynamic-graph-v3-py2-18.04-release

00:03:58

failed #89516
allowed to fail
robotpkg-py-dynamic-graph-v3-py3-16.04-release

00:02:06

passed #89517
robotpkg-py-dynamic-graph-v3-py3-18.04-release

00:04:02

passed #89521
robotpkg-py-dynamic-graph-v3-py3-20.04-release

00:03:56

passed #89524
robotpkg-py-dynamic-graph-v3-py3-buster-release

00:04:04

passed #89526
robotpkg-py-dynamic-graph-v3-py3-stretch-release

00:04:21

 
Name Stage Failure
failed
robotpkg-py-dynamic-graph-v3-py3-16.04-release Test
| make: *** [all] Error 2
For details or bug reports, check the complete log file in:
/root/robotpkg/wip/py-dynamic-graph-v3/work.runner-swwlejyc-project-167-concurrent-1/build.log

/root/robotpkg/mk/build/build.mk:198: recipe for target 'do-build' failed
make: *** [do-build] Error 2
make: *** [install] Error 2
/root/robotpkg/mk/internal/trusted.mk:36: recipe for target 'install' failed
ERROR: Job failed: exit code 1
failed
format Test
./src/dynamic_graph/signal_base.py:7:1: F401 '.wrap.SignalBase' imported but unused
./src/dynamic_graph/signal_base.py:7:1: F401 '.wrap.create_signal_wrapper as SignalWrapper' imported but unused
./src/dynamic_graph/signal_base.py:13:1: E302 expected 2 blank lines, found 1
./src/dynamic_graph/__init__.py:8:1: F401 'sys' imported but unused
./src/dynamic_graph/entity.py:8:1: F401 '.wrap.LoggerVerbosity as VerbosityLevel' imported but unused
./src/dynamic_graph/entity.py:9:1: F401 '.wrap.Entity' imported but unused
Running after_script
Uploading artifacts for failed job
ERROR: Job failed: exit code 1