v3.6.0

8 jobs for release/3.6.0 in 7 minutes and 2 seconds (queued for 3 seconds)
latest
Status Job ID Name Coverage
  Test
passed #89527
doc-coverage

00:03:18

65.0%
failed #89528
allowed to fail
format

00:00:11

passed #89519
robotpkg-py-dynamic-graph-v3-py2-18.04-release

00:03:59

failed #89515
allowed to fail
robotpkg-py-dynamic-graph-v3-py3-16.04-release

00:02:07

passed #89518
robotpkg-py-dynamic-graph-v3-py3-18.04-release

00:03:21

passed #89522
robotpkg-py-dynamic-graph-v3-py3-20.04-release

00:04:35

passed #89523
robotpkg-py-dynamic-graph-v3-py3-buster-release

00:03:25

passed #89525
robotpkg-py-dynamic-graph-v3-py3-stretch-release

00:06:59

 
Name Stage Failure
failed
robotpkg-py-dynamic-graph-v3-py3-16.04-release Test
| make: *** [all] Error 2

For details or bug reports, check the complete log file in:
/root/robotpkg/wip/py-dynamic-graph-v3/work.runner-swwlejyc-project-167-concurrent-0/build.log
make: *** [do-build] Error 2
/root/robotpkg/mk/build/build.mk:198: recipe for target 'do-build' failed
make: *** [install] Error 2
/root/robotpkg/mk/internal/trusted.mk:36: recipe for target 'install' failed
ERROR: Job failed: exit code 1
failed
format Test
./src/dynamic_graph/signal_base.py:7:1: F401 '.wrap.SignalBase' imported but unused
./src/dynamic_graph/signal_base.py:7:1: F401 '.wrap.create_signal_wrapper as SignalWrapper' imported but unused
./src/dynamic_graph/signal_base.py:13:1: E302 expected 2 blank lines, found 1
./src/dynamic_graph/__init__.py:8:1: F401 'sys' imported but unused
./src/dynamic_graph/entity.py:8:1: F401 '.wrap.LoggerVerbosity as VerbosityLevel' imported but unused
./src/dynamic_graph/entity.py:9:1: F401 '.wrap.Entity' imported but unused
Running after_script
Uploading artifacts for failed job
ERROR: Job failed: exit code 1